Antonio Costa - 2003-02-26

All help appreciated...

make  all-recursive
make[1]: Entering directory `/tmp/lufs-0.9.3'
Making all in kernel
make[2]: Entering directory `/tmp/lufs-0.9.3/kernel'
Making all in Linux
make[3]: Entering directory `/tmp/lufs-0.9.3/kernel/Linux'
Making all in 2.4
make[4]: Entering directory `/tmp/lufs-0.9.3/kernel/Linux/2.4'
source='file.c' object='file.o' libtool=no \ depfile='.deps/file.Po' tmpdepfile='.deps/file.TPo' \ depmode=gcc3 /bin/sh ../../../config/depcomp \ gcc -DHAVE_CONFIG_H -I. -I. -I../../.. -I/lib/modules/2.4.2-2/build/include  -I/tmp/lufs-0.9.3/include    -DMODVERSIONS -include /lib/modules/2.4.2-2/build/include/linux/modversions.h  -O2 -pipe -fomit-frame-pointer -fno-strict-aliasing -mpreferred-stack-boundary=2 -Wall -D__KERNEL__ -DMODULE -DLINUX -c `test -f 'file.c' || echo './'`file.c
file.c:288: `generic_file_llseek' undeclared here (not in a function)
file.c:288: initializer element is not constant
file.c:288: (near initialization for `lu_file_operations.llseek')
file.c:294: initializer element is not constant
file.c:294: (near initialization for `lu_file_operations')
make[4]: *** [file.o] Error 1
make[4]: Leaving directory `/tmp/lufs-0.9.3/kernel/Linux/2.4'
make[3]: *** [all-recursive] Error 1
make[3]: Leaving directory `/tmp/lufs-0.9.3/kernel/Linux'
make[2]: *** [all-recursive] Error 1
make[2]: Leaving directory `/tmp/lufs-0.9.3/kernel'
make[1]: *** [all-recursive] Error 1
make[1]: Leaving directory `/tmp/lufs-0.9.3'
make: *** [all] Error 2