Just to report that it worked out perfectly. Thanks Tim!
Philippe


On Tue, Dec 27, 2011 at 10:02 AM, Philippe Macaire <philippe.macaire@gmail.com> wrote:
OK Tim, thanks.

I'll check it home tonight. In the meantime... you can get some sleep :-)

Best,
Philippe



On Tue, Dec 27, 2011 at 9:17 AM, Tim E. Real <termtech@rogers.com> wrote:
On December 27, 2011 8:34:48 AM Philippe Macaire wrote:
> Hello developers, I wanted to give the release candidate a try, so I
> checked out the release_2_0 branch and tried to compile (using the script),
> but I got an error in arranger/tlist.cpp (see below): anything I could have
> done wrong? I should have all dependencies installed, since I already
> compiled MusE (last year I think -- but I don't remember of anything
> changed in that area).
>
> Thanks a lot.
>
> All the best,
> Philippe

Hi there.
Please install the 'liblo' (Lightweight Open Sound Control) package, and
 reconfigure and try to build again. Make sure OSC is shown in the
 '...will be built' list.

DSSI /can/ be used without OSC, but won't be very useful.

It's late and I just read this message.
I'll try to fix the specific error tomorrow in SVN, if no one else does.

Cheers. Tim.

>
>
> Build dir already exists
> -- Could NOT find Doxygen  (missing:  DOXYGEN_EXECUTABLE)
> Doxygen not found
> Unix (probably linux) found
> Qt QTNSPLUGIN library not found.
> -- checking for module 'liblo>=0.23'
> --   package 'liblo>=0.23' not found
> VST support disabled
>
> The following components will be built:
> -----------------------------------------------
>    Lash support
>    DSSI support
>    Fluidsynth support
>
> The following components WILL NOT be built:
> -----------------------------------------------
>    OSC (Liblo) support
>    Python support
>    VST support
>    Experimental features
>
>  Internal modules will be built as shared components.
>  Build type: release
>
> -- Configuring done
> -- Generating done
> -- Build files have been written to:
> /home/ph/Desktop/muse2RC/release_2_0/build
> [  0%] Built target al
> [ 12%] Built target awl
> [ 13%] Built target grepmidi
> [ 14%] Built target synti
> [ 14%] Built target icons
> [ 48%] Built target widgets
> [ 49%] Generating moc_cliplist.cxx
> Scanning dependencies of target cliplist
> [ 49%] Building CXX object muse/cliplist/CMakeFiles/cliplist.dir/cliplist.o
> [ 49%] Building CXX object
> muse/cliplist/CMakeFiles/cliplist.dir/moc_cliplist.o
> Linking CXX shared library libmuse_cliplist.so
> [ 49%] Built target cliplist
> [ 53%] Built target mixer
> [ 53%] Building CXX object muse/arranger/CMakeFiles/arranger.dir/tlist.o
> /home/ph/Desktop/muse2RC/release_2_0/muse/arranger/tlist.cpp: In member
> function ‘void MusEGui::TList::oportPropertyPopupMenu(MusECore::Track*,
> int, int)’:
> /home/ph/Desktop/muse2RC/release_2_0/muse/arranger/tlist.cpp:863: error:
> expected type-specifier before ‘DssiMusECore’
> /home/ph/Desktop/muse2RC/release_2_0/muse/arranger/tlist.cpp:863: error:
> expected ‘>’ before ‘DssiMusECore’
> /home/ph/Desktop/muse2RC/release_2_0/muse/arranger/tlist.cpp:863: error:
> expected ‘(’ before ‘DssiMusECore’
> /home/ph/Desktop/muse2RC/release_2_0/muse/arranger/tlist.cpp:863: error:
> ‘DssiMusECore’ has not been declared
> /home/ph/Desktop/muse2RC/release_2_0/muse/arranger/tlist.cpp:863: error:
> expected primary-expression before ‘>’ token
> /home/ph/Desktop/muse2RC/release_2_0/muse/arranger/tlist.cpp:864: error:
> expected ‘)’ before ‘{’ token
> /home/ph/Desktop/muse2RC/release_2_0/muse/arranger/tlist.cpp:873: warning:
> suggest braces around empty body in an ‘if’ statement
> /home/ph/Desktop/muse2RC/release_2_0/muse/arranger/tlist.cpp:875: error:
> ‘ract’ was not declared in this scope
> /home/ph/Desktop/muse2RC/release_2_0/muse/arranger/tlist.cpp:916: error:
> expected type-specifier before ‘DssiMusECore’
> /home/ph/Desktop/muse2RC/release_2_0/muse/arranger/tlist.cpp:916: error:
> expected ‘>’ before ‘DssiMusECore’
> /home/ph/Desktop/muse2RC/release_2_0/muse/arranger/tlist.cpp:916: error:
> expected ‘(’ before ‘DssiMusECore’
> /home/ph/Desktop/muse2RC/release_2_0/muse/arranger/tlist.cpp:916: error:
> ‘DssiMusECore’ has not been declared
> /home/ph/Desktop/muse2RC/release_2_0/muse/arranger/tlist.cpp:916: error:
> expected primary-expression before ‘>’ token
> /home/ph/Desktop/muse2RC/release_2_0/muse/arranger/tlist.cpp:917: error:
> expected ‘)’ before ‘{’ token
> /home/ph/Desktop/muse2RC/release_2_0/muse/arranger/tlist.cpp:926: warning:
> suggest braces around empty body in an ‘if’ statement
> /home/ph/Desktop/muse2RC/release_2_0/muse/arranger/tlist.cpp:928: error:
> ‘ract’ was not declared in this scope
> /home/ph/Desktop/muse2RC/release_2_0/muse/arranger/tlist.cpp: At global
> scope:
> /home/ph/Desktop/muse2RC/release_2_0/muse/arranger/tlist.cpp:833: warning:
> unused parameter ‘x’
> /home/ph/Desktop/muse2RC/release_2_0/muse/arranger/tlist.cpp:833: warning:
> unused parameter ‘y’
> make[2]: *** [muse/arranger/CMakeFiles/arranger.dir/tlist.o] Error 1
> make[1]: *** [muse/arranger/CMakeFiles/arranger.dir/all] Error 2
> make: *** [all] Error 2

------------------------------------------------------------------------------
Write once. Port to many.
Get the SDK and tools to simplify cross-platform app development. Create
new or port existing apps to sell to consumers worldwide. Explore the
Intel AppUpSM program developer opportunity. appdeveloper.intel.com/join
http://p.sf.net/sfu/intel-appdev
_______________________________________________
Lmuse-developer mailing list
Lmuse-developer@lists.sourceforge.net
https://lists.sourceforge.net/lists/listinfo/lmuse-developer