#170 SVN: amd64 asm errors

closed-wont-fix
nobody
None
5
2009-07-06
2007-10-30
tom
No

In current SVN there are compile errors on 64bit systems:

[ 1%] Building CXX object al/CMakeFiles/al.dir/xml.o
[ 1%] Building CXX object al/CMakeFiles/al.dir/dsp.o
[ 1%] Building CXX object al/CMakeFiles/al.dir/dspSSE.o
/var/tmp/portage/media-sound/museseq-9999/work/muse/al/dspSSE.cpp: Assembler messages:
/var/tmp/portage/media-sound/museseq-9999/work/muse/al/dspSSE.cpp:35: Error: suffix or operands invalid for `push'
/var/tmp/portage/media-sound/museseq-9999/work/muse/al/dspSSE.cpp:40: Error: suffix or operands invalid for `push'
/var/tmp/portage/media-sound/museseq-9999/work/muse/al/dspSSE.cpp:42: Error: suffix or operands invalid for `push'
/var/tmp/portage/media-sound/museseq-9999/work/muse/al/dspSSE.cpp:43: Error: suffix or operands invalid for `push'
/var/tmp/portage/media-sound/museseq-9999/work/muse/al/dspSSE.cpp:144: Error: suffix or operands invalid for `pop'
/var/tmp/portage/media-sound/museseq-9999/work/muse/al/dspSSE.cpp:145: Error: suffix or operands invalid for `pop'
/var/tmp/portage/media-sound/museseq-9999/work/muse/al/dspSSE.cpp:147: Error: suffix or operands invalid for `pop'
/var/tmp/portage/media-sound/museseq-9999/work/muse/al/dspSSE.cpp:169: Error: suffix or operands invalid for `push'
/var/tmp/portage/media-sound/museseq-9999/work/muse/al/dspSSE.cpp:174: Error: suffix or operands invalid for `push'
/var/tmp/portage/media-sound/museseq-9999/work/muse/al/dspSSE.cpp:176: Error: suffix or operands invalid for `push'
/var/tmp/portage/media-sound/museseq-9999/work/muse/al/dspSSE.cpp:177: Error: suffix or operands invalid for `push'
/var/tmp/portage/media-sound/museseq-9999/work/muse/al/dspSSE.cpp:260: Error: suffix or operands invalid for `pop'
/var/tmp/portage/media-sound/museseq-9999/work/muse/al/dspSSE.cpp:261: Error: suffix or operands invalid for `pop'
/var/tmp/portage/media-sound/museseq-9999/work/muse/al/dspSSE.cpp:263: Error: suffix or operands invalid for `pop'
/var/tmp/portage/media-sound/museseq-9999/work/muse/al/dspSSE.cpp:285: Error: suffix or operands invalid for `push'
/var/tmp/portage/media-sound/museseq-9999/work/muse/al/dspSSE.cpp:289: Error: suffix or operands invalid for `push'
/var/tmp/portage/media-sound/museseq-9999/work/muse/al/dspSSE.cpp:339: Error: suffix or operands invalid for `push'
/var/tmp/portage/media-sound/museseq-9999/work/muse/al/dspSSE.cpp:342: Error: suffix or operands invalid for `pop'
/var/tmp/portage/media-sound/museseq-9999/work/muse/al/dspSSE.cpp:384: Error: suffix or operands invalid for `pop'
/var/tmp/portage/media-sound/museseq-9999/work/muse/al/dspSSE.cpp:405: Error: suffix or operands invalid for `push'
/var/tmp/portage/media-sound/museseq-9999/work/muse/al/dspSSE.cpp:409: Error: suffix or operands invalid for `push'
/var/tmp/portage/media-sound/museseq-9999/work/muse/al/dspSSE.cpp:422: Error: suffix or operands invalid for `push'
/var/tmp/portage/media-sound/museseq-9999/work/muse/al/dspSSE.cpp:518: Error: suffix or operands invalid for `pop'
make[2]: *** [al/CMakeFiles/al.dir/dspSSE.o] Error 1
make[1]: *** [al/CMakeFiles/al.dir/all] Error 2
make: *** [all] Error 2

I would go compiling it 32bit, but then i would need 32bit qt4 too (it fails to link against 64bit qt4, of course)

Discussion

  • Robert Jonsson

    Robert Jonsson - 2009-07-06
    • status: open --> closed-wont-fix
     
  • Robert Jonsson

    Robert Jonsson - 2009-07-06

    The svn version is unfortunately not under development at the moment :(

     

Get latest updates about Open Source Projects, Conferences and News.

Sign up for the SourceForge newsletter:





No, thanks