#111 error compiling head

cvs(HEAD)
closed-fixed
nobody
None
5
2005-07-29
2005-07-26
No

g++ -DHAVE_CONFIG_H -I. -I. -I../.. -O0 -g
-fno-exceptions -Wall -W -Wno-effc++ -D_GNU_SOURCE
-D_REENTRANT -DQT_CLEAN_NAMESPACE -DQT_NO_COMPAT
-I/usr/lib/qt-3.3/include -I../../muse -DQT_SHARED
-DQT_THREAD_SUPPORT -DQT_PLUGIN -I../../synti -include
../../all-pic.h -g -O2 -MT fluidsynti.lo -MD -MP -MF
.deps/fluidsynti.Tpo -c fluidsynti.cpp -fPIC -DPIC -o
.libs/fluidsynti.o
In file included from fluidsynti.cpp:10:
fluidsynti.h:13:24: error: fluidsynth.h: No such file
or directory
/usr/lib/qt-3.3/include/qnetworkprotocol.h:58: warning:
'class QNetworkProtocolFactoryBase' has virtual
functions but non-virtual destructor
/usr/lib/qt-3.3/include/qfiledialog.h:78: warning:
'class QFilePreview' has virtual functions but
non-virtual destructor
/usr/lib/qt-3.3/include/qtooltip.h:86: warning: 'class
QToolTip' has virtual functions but non-virtual destructor
fluidsynti.h:120: error: ISO C++ forbids declaration of
'fluid_synth_t' with no type
fluidsynti.h:120: error: expected ';' before '*' token
fluidsynti.cpp: In constructor
'FluidSynth::FluidSynth(int)':
fluidsynti.cpp:52: error: 'fluid_settings_t' was not
declared in this scope
fluidsynti.cpp:52: error: 's' was not declared in this
scope
fluidsynti.cpp:52: error: 'new_fluid_settings' was not
declared in this scope
fluidsynti.cpp:53: error: 'fluid_settings_setnum' was
not declared in this scope
fluidsynti.cpp:54: error: 'fluidsynth' was not declared
in this scope
fluidsynti.cpp:54: error: 'new_fluid_synth' was not
declared in this scope
fluidsynti.cpp: In member function 'virtual void
FluidSynth::process(float**, int, int)':
fluidsynti.cpp:149: error: 'fluidsynth' was not
declared in this scope
fluidsynti.cpp:149: error: 'fluid_synth_write_float'
was not declared in this scope
fluidsynti.cpp: In function 'void* fontLoadThread(void*)':
fluidsynti.cpp:472: error: 'class FluidSynth' has no
member named 'fluidsynth'
fluidsynti.cpp:472: error: 'fluid_synth_sfload' was not
declared in this scope
fluidsynti.cpp:475: error: 'class FluidSynth' has no
member named 'fluidsynth'
fluidsynti.cpp:475: error: 'fluid_synth_error' was not
declared in this scope
fluidsynti.cpp:477: error: 'class FluidSynth' has no
member named 'fluidsynth'
fluidsynti.cpp: In member function 'virtual bool
FluidSynth::playNote(int, int, int)':
fluidsynti.cpp:541: error: 'fluidsynth' was not
declared in this scope
fluidsynti.cpp:541: error: 'fluid_synth_noteon' was not
declared in this scope
fluidsynti.cpp:543: error: 'fluid_synth_error' was not
declared in this scope
fluidsynti.cpp:547: error: 'fluidsynth' was not
declared in this scope
fluidsynti.cpp:547: error: 'fluid_synth_noteoff' was
not declared in this scope
fluidsynti.cpp:549: error: 'fluid_synth_error' was not
declared in this scope
fluidsynti.cpp: In member function 'void
FluidSynth::setController(int, int, int, bool)':
fluidsynti.cpp:674: error: 'fluidsynth' was not
declared in this scope
fluidsynti.cpp:674: error: 'fluid_synth_set_gain' was
not declared in this scope
fluidsynti.cpp:684: error: 'fluidsynth' was not
declared in this scope
fluidsynti.cpp:684: error: 'fluid_synth_set_reverb_on'
was not declared in this scope
fluidsynti.cpp:697: error: 'fluidsynth' was not
declared in this scope
fluidsynti.cpp:697: error: 'fluid_synth_set_reverb' was
not declared in this scope
fluidsynti.cpp:732: error: 'fluid_synth_set_chorus_on'
was not declared in this scope
fluidsynti.cpp:741: error: 'fluid_synth_set_chorus' was
not declared in this scope
fluidsynti.cpp:750: error: 'fluid_synth_set_chorus' was
not declared in this scope
fluidsynti.cpp:759: error: 'fluid_synth_set_chorus' was
not declared in this scope
fluidsynti.cpp:768: error: 'fluid_synth_set_chorus' was
not declared in this scope
fluidsynti.cpp:777: error: 'fluid_synth_set_chorus' was
not declared in this scope
fluidsynti.cpp:788: error: 'fluid_synth_pitch_bend' was
not declared in this scope
fluidsynti.cpp:803: error: 'fluid_synth_program_select'
was not declared in this scope
fluidsynti.cpp:805: error: 'fluid_synth_error' was not
declared in this scope
fluidsynti.cpp:815: error: 'fluid_synth_cc' was not
declared in this scope
fluidsynti.cpp:820: error: 'fluidsynth' was not
declared in this scope
fluidsynti.cpp:820: error: 'fluid_synth_error' was not
declared in this scope
fluidsynti.cpp: In member function 'void
FluidSynth::rewriteChannelSettings()':
fluidsynti.cpp:951: error: 'fluidsynth' was not
declared in this scope
fluidsynti.cpp:951: error: 'fluid_synth_program_select'
was not declared in this scope
fluidsynti.cpp:953: error: 'fluid_synth_error' was not
declared in this scope
fluidsynti.cpp: In member function 'virtual const char*
FluidSynth::getPatchName(int, int, int) const':
fluidsynti.cpp:969: error: 'fluid_preset_t' was not
declared in this scope
fluidsynti.cpp:969: error: 'preset' was not declared in
this scope
fluidsynti.cpp:969: error: 'fluidsynth' was not
declared in this scope
fluidsynti.cpp:969: error:
'fluid_synth_get_channel_preset' was not declared in
this scope
fluidsynti.cpp: In member function 'const MidiPatch*
FluidSynth::getFirstPatch(int) const':
fluidsynti.cpp:1005: error: 'fluid_preset_t' was not
declared in this scope
fluidsynti.cpp:1005: error: 'preset' was not declared
in this scope
fluidsynti.cpp:1010: error: 'fluid_sfont_t' was not
declared in this scope
fluidsynti.cpp:1010: error: 'sfont' was not declared in
this scope
fluidsynti.cpp:1010: error: 'fluidsynth' was not
declared in this scope
fluidsynti.cpp:1010: error:
'fluid_synth_get_sfont_by_id' was not declared in this
scope
fluidsynti.cpp: In member function 'const MidiPatch*
FluidSynth::getNextPatch(int, const MidiPatch*) const':
fluidsynti.cpp:1060: error: 'fluid_preset_t' was not
declared in this scope
fluidsynti.cpp:1060: error: 'preset' was not declared
in this scope
fluidsynti.cpp:1061: error: 'fluid_sfont_t' was not
declared in this scope
fluidsynti.cpp:1061: error: 'sfont' was not declared in
this scope
fluidsynti.cpp:1061: error: 'fluidsynth' was not
declared in this scope
fluidsynti.cpp:1061: error:
'fluid_synth_get_sfont_by_id' was not declared in this
scope
fluidsynti.cpp: In member function 'bool
FluidSynth::popSoundfont(int)':
fluidsynti.cpp:1112: error: 'fluidsynth' was not
declared in this scope
fluidsynti.cpp:1112: error: 'fluid_synth_sfunload' was
not declared in this scope
fluidsynti.cpp:1138: error: 'fluid_synth_error' was not
declared in this scope
make[5]: *** [fluidsynti.lo] Error 1
make[5]: Leaving directory
`/home/avp/soft/build/sound/muse/muse-2005-07-26/synti/fluidsynth'
make[4]: *** [all] Error 2
make[4]: Leaving directory
`/home/avp/soft/build/sound/muse/muse-2005-07-26/synti/fluidsynth'
make[3]: *** [all-recursive] Error 1
make[3]: Leaving directory
`/home/avp/soft/build/sound/muse/muse-2005-07-26/synti'
make[2]: *** [all] Error 2
make[2]: Leaving directory
`/home/avp/soft/build/sound/muse/muse-2005-07-26/synti'
make[1]: *** [all-recursive] Error 1
make[1]: Leaving directory
`/home/avp/soft/build/sound/muse/muse-2005-07-26'
make: *** [all] Error 2

Compilation options were:

./configure --enable-maintainer-mode
--disable-fluidsynth --enable-dssi

I have FC4 and gcc 4.0.0

Discussion

  • Robert Jonsson

    Robert Jonsson - 2005-07-29

    Logged In: YES
    user_id=81832

    Thanks for the report, I believe this is fixed now.

    As a reminder, development is split in two branches, HEAD and REL07.
    HEAD branch is currently under heavy development so it's only usable if you
    want to help further it, or just genuinely curious about the new looks :)

     
  • Robert Jonsson

    Robert Jonsson - 2005-07-29
    • status: open --> closed-fixed
     

Get latest updates about Open Source Projects, Conferences and News.

Sign up for the SourceForge newsletter:





No, thanks