Nestor Waldyd - 2005-04-28

When doing make, the following appears:

/usr/local/include/wx/font.h:145: declaracin de virtual fuera de class
/usr/local/include/wx/font.h:146: declaracin de virtual fuera de class
/usr/local/include/wx/font.h: En function `wxFontEncoding
   GetDefaultEncoding()':
/usr/local/include/wx/font.h:150: `ms_encodingDefault' sin declarar (primero
   use esta funcin)
/usr/local/include/wx/font.h: At global scope:
/usr/local/include/wx/font.h:153: error de decodificacin antes de `protected'
xh_bmpbt.cpp: En constructor
   `wxBitmapButtonXmlHandler::wxBitmapButtonXmlHandler()':
xh_bmpbt.cpp:28: `wxBU_AUTODRAW' sin declarar (primero use esta funcin)
xh_bmpbt.cpp:29: `wxBU_LEFT' sin declarar (primero use esta funcin)
xh_bmpbt.cpp:30: `wxBU_RIGHT' sin declarar (primero use esta funcin)
xh_bmpbt.cpp:31: `wxBU_TOP' sin declarar (primero use esta funcin)
xh_bmpbt.cpp:32: `wxBU_BOTTOM' sin declarar (primero use esta funcin)
xh_bmpbt.cpp: En member function `virtual wxObject*
   wxBitmapButtonXmlHandler::DoCreateResource()':
xh_bmpbt.cpp:38: `wxBitmapButton' sin declarar (primero use esta funcin)
xh_bmpbt.cpp:38: `button' sin declarar (primero use esta funcin)
xh_bmpbt.cpp:38: error de decodificacin antes del elemento `)'
xh_bmpbt.cpp:38: error de decodificacin antes del elemento `;'
xh_bmpbt.cpp:42: uso invlido del tipo indefinido `struct wxBitmap'
/usr/local/include/wx/gdicmn.h:35: declaracin hacia adelante de `struct
   wxBitmap'
xh_bmpbt.cpp:45: `wxDefaultValidator' sin declarar (primero use esta funcin)
xh_bmpbt.cpp:52: uso invlido del tipo indefinido `struct wxBitmap'
/usr/local/include/wx/gdicmn.h:35: declaracin hacia adelante de `struct
   wxBitmap'
xh_bmpbt.cpp:54: uso invlido del tipo indefinido `struct wxBitmap'
/usr/local/include/wx/gdicmn.h:35: declaracin hacia adelante de `struct
   wxBitmap'
xh_bmpbt.cpp:56: uso invlido del tipo indefinido `struct wxBitmap'
/usr/local/include/wx/gdicmn.h:35: declaracin hacia adelante de `struct
   wxBitmap'
make[4]: *** [xh_bmpbt.o] Error 1
make[4]: Saliendo directorio `/usr/local/lmule-1.2.1/src/wx/xrc'
make[3]: *** [all-recursive] Error 1
make[3]: Saliendo directorio `/usr/local/lmule-1.2.1/src/wx'
make[2]: *** [all-recursive] Error 1
make[2]: Saliendo directorio `/usr/local/lmule-1.2.1/src'
make[1]: *** [all-recursive] Error 1
make[1]: Saliendo directorio `/usr/local/lmule-1.2.1'
make: *** [all] Error 2
[waldyd@Airei lmule-1.2.1]$

how do i solve this??