[root@Multimedia Linux]# make KERNELDIR=/home/bakhaled/Documents/linux-2.6.17.14_stm22_0037/
make -C /home/bakhaled/Documents/linux-2.6.17.14_stm22_0037/  M="/home/bakhaled/kernelmodules/Linux/../Linux/kbuild" ARCH=sh CROSS_COMPILE="sh4-linux-" modules
make[1]: entrant dans le répertoire « /home/bakhaled/Documents/linux-2.6.17.14_stm22_0037 »

  WARNING: Symbol version dump /home/bakhaled/Documents/linux-2.6.17.14_stm22_0037/Module.symvers
           is missing; modules will have no dependencies and modversions.

  CC [M]  /home/bakhaled/kernelmodules/Linux/../Linux/kbuild/../../Linux/video/devfb.o
cc1plus: attention : l'option de la ligne de commande "-Wno-pointer-sign" est valide pour C/ObjC mais pas pour C++
/home/bakhaled/kernelmodules/Linux/../Linux/kbuild/../../Linux/video/devfb.cpp:12:32: erreur: Generic/basictypes.h : Aucun fichier ou répertoire de ce type
/home/bakhaled/kernelmodules/Linux/../Linux/kbuild/../../Linux/video/devfb.cpp:13:25: erreur: Generic/IOS.h : Aucun fichier ou répertoire de ce type
/home/bakhaled/kernelmodules/Linux/../Linux/kbuild/../../Linux/video/devfb.cpp:14:28: erreur: Generic/IDebug.h : Aucun fichier ou répertoire de ce type
/home/bakhaled/kernelmodules/Linux/../Linux/kbuild/../../Linux/video/devfb.cpp:16:38: erreur: Generic/stmdisplayoutput.h : Aucun fichier ou répertoire de ce type
/home/bakhaled/kernelmodules/Linux/../Linux/kbuild/../../Linux/video/devfb.cpp:17:36: erreur: Generic/STDisplayPlane.h : Aucun fichier ou répertoire de ce type
/home/bakhaled/kernelmodules/Linux/../Linux/kbuild/../../Linux/video/devfb.cpp:19:25: erreur: Generic/GAL.h : Aucun fichier ou répertoire de ce type
/home/bakhaled/kernelmodules/Linux/../Linux/kbuild/../../Linux/video/devfb.cpp:20:28: erreur: Generic/Output.h : Aucun fichier ou répertoire de ce type
/home/bakhaled/kernelmodules/Linux/../Linux/kbuild/../../Linux/video/devfb.cpp:21:34: erreur: Generic/DisplayPlane.h : Aucun fichier ou répertoire de ce type
/home/bakhaled/kernelmodules/Linux/../Linux/kbuild/../../Linux/video/devfb.cpp:22:35: erreur: Generic/DisplayDevice.h : Aucun fichier ou répertoire de ce type
/home/bakhaled/kernelmodules/Linux/../Linux/video/stmfb.h:106: erreur: 'SURF_FMT' does not name a type
/home/bakhaled/kernelmodules/Linux/../Linux/video/stmfb.h:107: erreur: 'SURF_FMT' does not name a type
/home/bakhaled/kernelmodules/Linux/../Linux/kbuild/../../Linux/video/devfb.h:26: erreur: 'ULONG' does not name a type
/home/bakhaled/kernelmodules/Linux/../Linux/kbuild/../../Linux/video/devfb.h:27: erreur: 'ULONG' does not name a type
/home/bakhaled/kernelmodules/Linux/../Linux/kbuild/../../Linux/video/devfb.h:28: erreur: 'ULONG' does not name a type
/home/bakhaled/kernelmodules/Linux/../Linux/kbuild/../../Linux/video/devfb.h:29: erreur: 'SURF_FMT' does not name a type
/home/bakhaled/kernelmodules/Linux/../Linux/kbuild/../../Linux/video/devfb.h:30: erreur: 'ULONG' does not name a type
/home/bakhaled/kernelmodules/Linux/../Linux/kbuild/../../Linux/video/devfb.h:32: erreur: 'ULONG' does not name a type
/home/bakhaled/kernelmodules/Linux/../Linux/kbuild/../../Linux/video/devfb.h:33: erreur: 'ULONG' does not name a type
/home/bakhaled/kernelmodules/Linux/../Linux/kbuild/../../Linux/video/devfb.h:34: erreur: 'ULONG' does not name a type
/home/bakhaled/kernelmodules/Linux/../Linux/kbuild/../../Linux/video/devfb.h:36: erreur: 'stm_scan_type_t' does not name a type
/home/bakhaled/kernelmodules/Linux/../Linux/kbuild/../../Linux/video/devfb.h:38: erreur: 'ULONG' does not name a type
/home/bakhaled/kernelmodules/Linux/../Linux/kbuild/../../Linux/video/devfb.h:39: erreur: 'ULONG' does not name a type
/home/bakhaled/kernelmodules/Linux/../Linux/kbuild/../../Linux/video/devfb.h:40: erreur: 'ULONG' does not name a type
/home/bakhaled/kernelmodules/Linux/../Linux/kbuild/../../Linux/video/devfb.h:41: erreur: 'ULONG' does not name a type
/home/bakhaled/kernelmodules/Linux/../Linux/kbuild/../../Linux/video/devfb.h:43: erreur: 'ULONG' does not name a type
/home/bakhaled/kernelmodules/Linux/../Linux/kbuild/../../Linux/video/devfb.h:44: erreur: ISO C++ forbids declaration of 'stm_mode_line_t' with no type
/home/bakhaled/kernelmodules/Linux/../Linux/kbuild/../../Linux/video/devfb.h:44: erreur: expected ';' before '*' token
/home/bakhaled/kernelmodules/Linux/../Linux/kbuild/../../Linux/video/devfb.h:47: erreur: 'ULONG' does not name a type
/home/bakhaled/kernelmodules/Linux/../Linux/kbuild/../../Linux/video/devfb.h:60: erreur: 'stm_field_t' does not name a type
/home/bakhaled/kernelmodules/Linux/../Linux/kbuild/../../Linux/video/devfb.h:66: erreur: 'ULONG' does not name a type
/home/bakhaled/kernelmodules/Linux/../Linux/kbuild/../../Linux/video/devfb.h:67: erreur: 'UCHAR' has not been declared
/home/bakhaled/kernelmodules/Linux/../Linux/kbuild/../../Linux/video/devfb.h:68: erreur: 'ULONG' does not name a type
/home/bakhaled/kernelmodules/Linux/../Linux/kbuild/../../Linux/video/devfb.h:71: erreur: expected initializer before '*' token
/home/bakhaled/kernelmodules/Linux/../Linux/kbuild/../../Linux/video/devfb.h:72: erreur: expected initializer before '*' token
/home/bakhaled/kernelmodules/Linux/../Linux/kbuild/../../Linux/video/devfb.h:73: erreur: expected initializer before '*' token
/home/bakhaled/kernelmodules/Linux/../Linux/kbuild/../../Linux/video/devfb.h:76: erreur: expected ',' or '...' before '*' token
/home/bakhaled/kernelmodules/Linux/../Linux/kbuild/../../Linux/video/devfb.h:76: erreur: ISO C++ forbids declaration of 'stm_mode_line_t' with no type
/home/bakhaled/kernelmodules/Linux/../Linux/kbuild/../../Linux/video/devfb.h:81: erreur: 'ULONG' has not been declared
/home/bakhaled/kernelmodules/Linux/../Linux/kbuild/../../Linux/video/devfb.h:82: erreur: 'stm_output_control_t' has not been declared
/home/bakhaled/kernelmodules/Linux/../Linux/kbuild/../../Linux/video/devfb.h:82: erreur: 'ULONG' has not been declared
/home/bakhaled/kernelmodules/Linux/../Linux/kbuild/../../Linux/video/devfb.h:83: erreur: 'stm_output_control_t' has not been declared
/home/bakhaled/kernelmodules/Linux/../Linux/kbuild/../../Linux/video/devfb.h:83: erreur: 'ULONG' has not been declared
/home/bakhaled/kernelmodules/Linux/../Linux/kbuild/../../Linux/video/devfb.h:85: erreur: 'ULONG' has not been declared
/home/bakhaled/kernelmodules/Linux/../Linux/kbuild/../../Linux/video/devfb.h:86: erreur: 'ULONG' has not been declared
/home/bakhaled/kernelmodules/Linux/../Linux/kbuild/../../Linux/video/devfb.h:87: erreur: 'ULONG' has not been declared
/home/bakhaled/kernelmodules/Linux/../Linux/kbuild/../../Linux/video/devfb.h:88: erreur: 'ULONG' has not been declared
/home/bakhaled/kernelmodules/Linux/../Linux/kbuild/../../Linux/video/devfb.h:89: erreur: 'ULONG' has not been declared
/home/bakhaled/kernelmodules/Linux/../Linux/kbuild/../../Linux/video/devfb.h:91: erreur: 'stm_display_status_t' has not been declared
/home/bakhaled/kernelmodules/Linux/../Linux/kbuild/../../Linux/video/devfb.h:94: erreur: 'GDP_IDS' has not been declared
/home/bakhaled/kernelmodules/Linux/../Linux/kbuild/../../Linux/video/devfb.h:96: erreur: 'PLANE_CAPS' has not been declared
/home/bakhaled/kernelmodules/Linux/../Linux/kbuild/../../Linux/video/devfb.h:97: erreur: 'ULONG' has not been declared
/home/bakhaled/kernelmodules/Linux/../Linux/kbuild/../../Linux/video/devfb.h:104: erreur: 'SURF_FMT' has not been declared
/home/bakhaled/kernelmodules/Linux/../Linux/kbuild/../../Linux/video/devfb.h:109: erreur: 'ULONG' was not declared in this scope
/home/bakhaled/kernelmodules/Linux/../Linux/kbuild/../../Linux/video/devfb.h:109: erreur: 'ULONG' was not declared in this scope
/home/bakhaled/kernelmodules/Linux/../Linux/kbuild/../../Linux/video/devfb.h:110: erreur: 'ULONG' was not declared in this scope
/home/bakhaled/kernelmodules/Linux/../Linux/kbuild/../../Linux/video/devfb.h:110: erreur: 'ULONG' was not declared in this scope
/home/bakhaled/kernelmodules/Linux/../Linux/kbuild/../../Linux/video/devfb.h:111: erreur: 'ULONG' was not declared in this scope
/home/bakhaled/kernelmodules/Linux/../Linux/kbuild/../../Linux/video/devfb.h:111: erreur: 'SURF_FMT' was not declared in this scope
/home/bakhaled/kernelmodules/Linux/../Linux/kbuild/../../Linux/video/devfb.h:111: erreur: initializer liste d'expressions traitée comme une expression composée
/home/bakhaled/kernelmodules/Linux/../Linux/kbuild/../../Linux/video/devfb.cpp:60: erreur: 'ULONG' does not name a type
/home/bakhaled/kernelmodules/Linux/../Linux/kbuild/../../Linux/video/devfb.cpp:62: erreur: expected initializer before '*' token
/home/bakhaled/kernelmodules/Linux/../Linux/kbuild/../../Linux/video/devfb.cpp: In function 'int DevfbInit()':
/home/bakhaled/kernelmodules/Linux/../Linux/kbuild/../../Linux/video/devfb.cpp:70: erreur: 'g_pIOS' was not declared in this scope
/home/bakhaled/kernelmodules/Linux/../Linux/kbuild/../../Linux/video/devfb.cpp:73: erreur: 'g_pIDebug' was not declared in this scope
/home/bakhaled/kernelmodules/Linux/../Linux/kbuild/../../Linux/video/devfb.cpp:76: erreur: 'devfbMutex' was not declared in this scope
/home/bakhaled/kernelmodules/Linux/../Linux/kbuild/../../Linux/video/devfb.cpp:76: erreur: 'g_pIOS' was not declared in this scope
/home/bakhaled/kernelmodules/Linux/../Linux/kbuild/../../Linux/video/devfb.cpp:81: erreur: 'devfbDevice' was not declared in this scope
/home/bakhaled/kernelmodules/Linux/../Linux/kbuild/../../Linux/video/devfb.cpp:81: erreur: 'AnonymousCreateDevice' was not declared in this scope
/home/bakhaled/kernelmodules/Linux/../Linux/kbuild/../../Linux/video/devfb.cpp:83: erreur: 'DEBUGF2' was not declared in this scope
/home/bakhaled/kernelmodules/Linux/../Linux/kbuild/../../Linux/video/devfb.cpp:88: erreur: 'devfbDevice' was not declared in this scope
/home/bakhaled/kernelmodules/Linux/../Linux/kbuild/../../Linux/video/devfb.cpp:90: erreur: 'DEBUGF2' was not declared in this scope
/home/bakhaled/kernelmodules/Linux/../Linux/kbuild/../../Linux/video/devfb.cpp:91: erreur: type '<type error>' argument given to 'delete', expected pointer
/home/bakhaled/kernelmodules/Linux/../Linux/kbuild/../../Linux/video/devfb.cpp:98: erreur: 'DEBUGF2' was not declared in this scope
/home/bakhaled/kernelmodules/Linux/../Linux/kbuild/../../Linux/video/devfb.cpp: In function 'int DevfbFinish()':
/home/bakhaled/kernelmodules/Linux/../Linux/kbuild/../../Linux/video/devfb.cpp:107: erreur: 'ASSERTF' was not declared in this scope
/home/bakhaled/kernelmodules/Linux/../Linux/kbuild/../../Linux/video/devfb.cpp:109: erreur: 'devfbDevice' was not declared in this scope
/home/bakhaled/kernelmodules/Linux/../Linux/kbuild/../../Linux/video/devfb.cpp:112: erreur: 'devfbMutex' was not declared in this scope
/home/bakhaled/kernelmodules/Linux/../Linux/kbuild/../../Linux/video/devfb.cpp:114: erreur: 'g_pIOS' was not declared in this scope
/home/bakhaled/kernelmodules/Linux/../Linux/kbuild/../../Linux/video/devfb.cpp:118: erreur: 'g_pIOS' was not declared in this scope
/home/bakhaled/kernelmodules/Linux/../Linux/kbuild/../../Linux/video/devfb.cpp:119: erreur: 'g_pIDebug' was not declared in this scope
/home/bakhaled/kernelmodules/Linux/../Linux/kbuild/../../Linux/video/devfb.cpp: In function 'void* DevfbGetDevice()':
/home/bakhaled/kernelmodules/Linux/../Linux/kbuild/../../Linux/video/devfb.cpp:128: erreur: 'devfbDevice' was not declared in this scope
/home/bakhaled/kernelmodules/Linux/../Linux/kbuild/../../Linux/video/devfb.cpp: At global scope:
/home/bakhaled/kernelmodules/Linux/../Linux/kbuild/../../Linux/video/devfb.cpp:135: erreur: 'GDP_IDS' has not been declared
/home/bakhaled/kernelmodules/Linux/../Linux/kbuild/../../Linux/video/devfb.cpp: In function 'void* DevfbGetPlane(void*, int)':
/home/bakhaled/kernelmodules/Linux/../Linux/kbuild/../../Linux/video/devfb.cpp:137: attention : left-hand operand of comma n'a pas d'effet
/home/bakhaled/kernelmodules/Linux/../Linux/kbuild/../../Linux/video/devfb.cpp:137: attention : right-hand operand of comma n'a pas d'effet
/home/bakhaled/kernelmodules/Linux/../Linux/kbuild/../../Linux/video/devfb.cpp:137: erreur: 'DEBUGF2' was not declared in this scope
/home/bakhaled/kernelmodules/Linux/../Linux/kbuild/../../Linux/video/devfb.cpp:140: erreur: 'g_pIOS' was not declared in this scope
/home/bakhaled/kernelmodules/Linux/../Linux/kbuild/../../Linux/video/devfb.cpp:140: erreur: 'devfbMutex' was not declared in this scope
/home/bakhaled/kernelmodules/Linux/../Linux/kbuild/../../Linux/video/devfb.cpp:143: erreur: 'CDisplayDevice' was not declared in this scope
/home/bakhaled/kernelmodules/Linux/../Linux/kbuild/../../Linux/video/devfb.cpp:143: erreur: expected primary-expression before ')' token
/home/bakhaled/kernelmodules/Linux/../Linux/kbuild/../../Linux/video/devfb.cpp:143: erreur: expected `)' before 'devptr'
/home/bakhaled/kernelmodules/Linux/../Linux/kbuild/../../Linux/video/devfb.cpp:145: erreur: 'g_pIOS' was not declared in this scope
/home/bakhaled/kernelmodules/Linux/../Linux/kbuild/../../Linux/video/devfb.cpp:145: erreur: 'devfbMutex' was not declared in this scope
/home/bakhaled/kernelmodules/Linux/../Linux/kbuild/../../Linux/video/devfb.cpp: In function 'int DevfbReleasePlane(void*, void*)':
/home/bakhaled/kernelmodules/Linux/../Linux/kbuild/../../Linux/video/devfb.cpp:152: erreur: 'CDisplayPlane' was not declared in this scope
/home/bakhaled/kernelmodules/Linux/../Linux/kbuild/../../Linux/video/devfb.cpp:152: erreur: 'pDP' was not declared in this scope
/home/bakhaled/kernelmodules/Linux/../Linux/kbuild/../../Linux/video/devfb.cpp:152: erreur: expected primary-expression before ')' token
/home/bakhaled/kernelmodules/Linux/../Linux/kbuild/../../Linux/video/devfb.cpp:152: erreur: expected `;' before 'pPlane'
/home/bakhaled/kernelmodules/Linux/../Linux/kbuild/../../Linux/video/devfb.cpp:153: erreur: 'CDisplayDevice' was not declared in this scope
/home/bakhaled/kernelmodules/Linux/../Linux/kbuild/../../Linux/video/devfb.cpp:153: erreur: 'pDev' was not declared in this scope
/home/bakhaled/kernelmodules/Linux/../Linux/kbuild/../../Linux/video/devfb.cpp:153: erreur: expected primary-expression before ')' token
/home/bakhaled/kernelmodules/Linux/../Linux/kbuild/../../Linux/video/devfb.cpp:153: erreur: expected `;' before 'devptr'
/home/bakhaled/kernelmodules/Linux/../Linux/kbuild/../../Linux/video/devfb.cpp:155: attention : left-hand operand of comma n'a pas d'effet
/home/bakhaled/kernelmodules/Linux/../Linux/kbuild/../../Linux/video/devfb.cpp:155: attention : right-hand operand of comma n'a pas d'effet
/home/bakhaled/kernelmodules/Linux/../Linux/kbuild/../../Linux/video/devfb.cpp:155: erreur: 'DEBUGF2' was not declared in this scope
/home/bakhaled/kernelmodules/Linux/../Linux/kbuild/../../Linux/video/devfb.cpp:156: erreur: 'ASSERTF' was not declared in this scope
/home/bakhaled/kernelmodules/Linux/../Linux/kbuild/../../Linux/video/devfb.cpp:158: erreur: 'g_pIOS' was not declared in this scope
/home/bakhaled/kernelmodules/Linux/../Linux/kbuild/../../Linux/video/devfb.cpp:158: erreur: 'devfbMutex' was not declared in this scope
/home/bakhaled/kernelmodules/Linux/../Linux/kbuild/../../Linux/video/devfb.cpp:163: erreur: 'g_pIOS' was not declared in this scope
/home/bakhaled/kernelmodules/Linux/../Linux/kbuild/../../Linux/video/devfb.cpp:163: erreur: 'devfbMutex' was not declared in this scope
/home/bakhaled/kernelmodules/Linux/../Linux/kbuild/../../Linux/video/devfb.cpp: At global scope:
/home/bakhaled/kernelmodules/Linux/../Linux/kbuild/../../Linux/video/devfb.cpp:169: erreur: 'ULONG' has not been declared
/home/bakhaled/kernelmodules/Linux/../Linux/kbuild/../../Linux/video/devfb.cpp: In function 'int DevfbPausePlane(void*, int)':
/home/bakhaled/kernelmodules/Linux/../Linux/kbuild/../../Linux/video/devfb.cpp:171: erreur: 'ASSERTF' was not declared in this scope
/home/bakhaled/kernelmodules/Linux/../Linux/kbuild/../../Linux/video/devfb.cpp:173: erreur: 'g_pIOS' was not declared in this scope
/home/bakhaled/kernelmodules/Linux/../Linux/kbuild/../../Linux/video/devfb.cpp:173: erreur: 'devfbMutex' was not declared in this scope
/home/bakhaled/kernelmodules/Linux/../Linux/kbuild/../../Linux/video/devfb.cpp:176: erreur: 'CDisplayPlane' was not declared in this scope
/home/bakhaled/kernelmodules/Linux/../Linux/kbuild/../../Linux/video/devfb.cpp:176: erreur: expected primary-expression before ')' token
/home/bakhaled/kernelmodules/Linux/../Linux/kbuild/../../Linux/video/devfb.cpp:176: erreur: expected `)' before 'pPlane'
/home/bakhaled/kernelmodules/Linux/../Linux/kbuild/../../Linux/video/devfb.cpp:178: erreur: 'g_pIOS' was not declared in this scope
/home/bakhaled/kernelmodules/Linux/../Linux/kbuild/../../Linux/video/devfb.cpp:178: erreur: 'devfbMutex' was not declared in this scope
/home/bakhaled/kernelmodules/Linux/../Linux/kbuild/../../Linux/video/devfb.cpp: In function 'int DevfbResumePlane(void*)':
/home/bakhaled/kernelmodules/Linux/../Linux/kbuild/../../Linux/video/devfb.cpp:186: erreur: 'ASSERTF' was not declared in this scope
/home/bakhaled/kernelmodules/Linux/../Linux/kbuild/../../Linux/video/devfb.cpp:188: erreur: 'g_pIOS' was not declared in this scope
/home/bakhaled/kernelmodules/Linux/../Linux/kbuild/../../Linux/video/devfb.cpp:188: erreur: 'devfbMutex' was not declared in this scope
/home/bakhaled/kernelmodules/Linux/../Linux/kbuild/../../Linux/video/devfb.cpp:191: erreur: 'CDisplayPlane' was not declared in this scope
/home/bakhaled/kernelmodules/Linux/../Linux/kbuild/../../Linux/video/devfb.cpp:191: erreur: expected primary-expression before ')' token
/home/bakhaled/kernelmodules/Linux/../Linux/kbuild/../../Linux/video/devfb.cpp:191: erreur: expected `)' before 'pPlane'
/home/bakhaled/kernelmodules/Linux/../Linux/kbuild/../../Linux/video/devfb.cpp:193: erreur: 'g_pIOS' was not declared in this scope
/home/bakhaled/kernelmodules/Linux/../Linux/kbuild/../../Linux/video/devfb.cpp:193: erreur: 'devfbMutex' was not declared in this scope
/home/bakhaled/kernelmodules/Linux/../Linux/kbuild/../../Linux/video/devfb.cpp: In function 'int DevfbFlushPlane(void*)':
/home/bakhaled/kernelmodules/Linux/../Linux/kbuild/../../Linux/video/devfb.cpp:201: erreur: 'ASSERTF' was not declared in this scope
/home/bakhaled/kernelmodules/Linux/../Linux/kbuild/../../Linux/video/devfb.cpp:203: erreur: 'g_pIOS' was not declared in this scope
/home/bakhaled/kernelmodules/Linux/../Linux/kbuild/../../Linux/video/devfb.cpp:203: erreur: 'devfbMutex' was not declared in this scope
/home/bakhaled/kernelmodules/Linux/../Linux/kbuild/../../Linux/video/devfb.cpp:206: erreur: 'CDisplayPlane' was not declared in this scope
/home/bakhaled/kernelmodules/Linux/../Linux/kbuild/../../Linux/video/devfb.cpp:206: erreur: expected primary-expression before ')' token
/home/bakhaled/kernelmodules/Linux/../Linux/kbuild/../../Linux/video/devfb.cpp:206: erreur: expected `)' before 'pPlane'
/home/bakhaled/kernelmodules/Linux/../Linux/kbuild/../../Linux/video/devfb.cpp:208: erreur: 'g_pIOS' was not declared in this scope
/home/bakhaled/kernelmodules/Linux/../Linux/kbuild/../../Linux/video/devfb.cpp:208: erreur: 'devfbMutex' was not declared in this scope
/home/bakhaled/kernelmodules/Linux/../Linux/kbuild/../../Linux/video/devfb.cpp: In function 'int DevfbAttachOutputToPlane(void*, void*)':
/home/bakhaled/kernelmodules/Linux/../Linux/kbuild/../../Linux/video/devfb.cpp:216: erreur: 'CDisplayPlane' was not declared in this scope
/home/bakhaled/kernelmodules/Linux/../Linux/kbuild/../../Linux/video/devfb.cpp:216: erreur: 'pDP' was not declared in this scope
/home/bakhaled/kernelmodules/Linux/../Linux/kbuild/../../Linux/video/devfb.cpp:216: erreur: expected primary-expression before ')' token
/home/bakhaled/kernelmodules/Linux/../Linux/kbuild/../../Linux/video/devfb.cpp:216: erreur: expected `;' before 'pPlane'
/home/bakhaled/kernelmodules/Linux/../Linux/kbuild/../../Linux/video/devfb.cpp:219: attention : left-hand operand of comma n'a pas d'effet
/home/bakhaled/kernelmodules/Linux/../Linux/kbuild/../../Linux/video/devfb.cpp:219: attention : right-hand operand of comma n'a pas d'effet
/home/bakhaled/kernelmodules/Linux/../Linux/kbuild/../../Linux/video/devfb.cpp:219: erreur: 'DEBUGF2' was not declared in this scope
/home/bakhaled/kernelmodules/Linux/../Linux/kbuild/../../Linux/video/devfb.cpp:220: erreur: 'ASSERTF' was not declared in this scope
/home/bakhaled/kernelmodules/Linux/../Linux/kbuild/../../Linux/video/devfb.cpp:222: erreur: 'g_pIOS' was not declared in this scope
/home/bakhaled/kernelmodules/Linux/../Linux/kbuild/../../Linux/video/devfb.cpp:222: erreur: 'devfbMutex' was not declared in this scope
/home/bakhaled/kernelmodules/Linux/../Linux/kbuild/../../Linux/video/devfb.cpp:225: erreur: 'COutput' was not declared in this scope
/home/bakhaled/kernelmodules/Linux/../Linux/kbuild/../../Linux/video/devfb.cpp:225: erreur: expected primary-expression before ')' token
/home/bakhaled/kernelmodules/Linux/../Linux/kbuild/../../Linux/video/devfb.cpp:227: erreur: 'g_pIOS' was not declared in this scope
/home/bakhaled/kernelmodules/Linux/../Linux/kbuild/../../Linux/video/devfb.cpp:227: erreur: 'devfbMutex' was not declared in this scope
/home/bakhaled/kernelmodules/Linux/../Linux/kbuild/../../Linux/video/devfb.cpp: In function 'int DevfbDetachOutputFromPlane(void*, void*)':
/home/bakhaled/kernelmodules/Linux/../Linux/kbuild/../../Linux/video/devfb.cpp:235: erreur: 'CDisplayPlane' was not declared in this scope
/home/bakhaled/kernelmodules/Linux/../Linux/kbuild/../../Linux/video/devfb.cpp:235: erreur: 'pDP' was not declared in this scope
/home/bakhaled/kernelmodules/Linux/../Linux/kbuild/../../Linux/video/devfb.cpp:235: erreur: expected primary-expression before ')' token
/home/bakhaled/kernelmodules/Linux/../Linux/kbuild/../../Linux/video/devfb.cpp:235: erreur: expected `;' before 'pPlane'
/home/bakhaled/kernelmodules/Linux/../Linux/kbuild/../../Linux/video/devfb.cpp:236: erreur: 'COutput' was not declared in this scope
/home/bakhaled/kernelmodules/Linux/../Linux/kbuild/../../Linux/video/devfb.cpp:236: erreur: 'pOut' was not declared in this scope
/home/bakhaled/kernelmodules/Linux/../Linux/kbuild/../../Linux/video/devfb.cpp:236: erreur: expected primary-expression before ')' token
/home/bakhaled/kernelmodules/Linux/../Linux/kbuild/../../Linux/video/devfb.cpp:236: erreur: expected `;' before 'pOutput'
/home/bakhaled/kernelmodules/Linux/../Linux/kbuild/../../Linux/video/devfb.cpp:238: attention : left-hand operand of comma n'a pas d'effet
/home/bakhaled/kernelmodules/Linux/../Linux/kbuild/../../Linux/video/devfb.cpp:238: attention : right-hand operand of comma n'a pas d'effet
/home/bakhaled/kernelmodules/Linux/../Linux/kbuild/../../Linux/video/devfb.cpp:238: erreur: 'DEBUGF2' was not declared in this scope
/home/bakhaled/kernelmodules/Linux/../Linux/kbuild/../../Linux/video/devfb.cpp:239: erreur: 'ASSERTF' was not declared in this scope
/home/bakhaled/kernelmodules/Linux/../Linux/kbuild/../../Linux/video/devfb.cpp:241: erreur: 'g_pIOS' was not declared in this scope
/home/bakhaled/kernelmodules/Linux/../Linux/kbuild/../../Linux/video/devfb.cpp:241: erreur: 'devfbMutex' was not declared in this scope
/home/bakhaled/kernelmodules/Linux/../Linux/kbuild/../../Linux/video/devfb.cpp:246: erreur: 'g_pIOS' was not declared in this scope
/home/bakhaled/kernelmodules/Linux/../Linux/kbuild/../../Linux/video/devfb.cpp:246: erreur: 'devfbMutex' was not declared in this scope
/home/bakhaled/kernelmodules/Linux/../Linux/kbuild/../../Linux/video/devfb.cpp: At global scope:
/home/bakhaled/kernelmodules/Linux/../Linux/kbuild/../../Linux/video/devfb.cpp:252: erreur: 'SURF_FMT' has not been declared
/home/bakhaled/kernelmodules/Linux/../Linux/kbuild/../../Linux/video/devfb.cpp: In function 'int DevfbGetPlaneFormats(void*, int**)':
/home/bakhaled/kernelmodules/Linux/../Linux/kbuild/../../Linux/video/devfb.cpp:254: erreur: 'ASSERTF' was not declared in this scope
/home/bakhaled/kernelmodules/Linux/../Linux/kbuild/../../Linux/video/devfb.cpp:257: erreur: 'g_pIOS' was not declared in this scope
/home/bakhaled/kernelmodules/Linux/../Linux/kbuild/../../Linux/video/devfb.cpp:257: erreur: 'devfbMutex' was not declared in this scope
/home/bakhaled/kernelmodules/Linux/../Linux/kbuild/../../Linux/video/devfb.cpp:260: erreur: 'CDisplayPlane' was not declared in this scope
/home/bakhaled/kernelmodules/Linux/../Linux/kbuild/../../Linux/video/devfb.cpp:260: erreur: expected primary-expression before ')' token
/home/bakhaled/kernelmodules/Linux/../Linux/kbuild/../../Linux/video/devfb.cpp:260: erreur: expected `)' before 'pPlane'
/home/bakhaled/kernelmodules/Linux/../Linux/kbuild/../../Linux/video/devfb.cpp:262: erreur: 'g_pIOS' was not declared in this scope
/home/bakhaled/kernelmodules/Linux/../Linux/kbuild/../../Linux/video/devfb.cpp:262: erreur: 'devfbMutex' was not declared in this scope
/home/bakhaled/kernelmodules/Linux/../Linux/kbuild/../../Linux/video/devfb.cpp: At global scope:
/home/bakhaled/kernelmodules/Linux/../Linux/kbuild/../../Linux/video/devfb.cpp:268: erreur: 'PLANE_CAPS' has not been declared
/home/bakhaled/kernelmodules/Linux/../Linux/kbuild/../../Linux/video/devfb.cpp: In function 'int DevfbGetPlaneCaps(void*, int*)':
/home/bakhaled/kernelmodules/Linux/../Linux/kbuild/../../Linux/video/devfb.cpp:270: erreur: 'ASSERTF' was not declared in this scope
/home/bakhaled/kernelmodules/Linux/../Linux/kbuild/../../Linux/video/devfb.cpp:272: erreur: 'g_pIOS' was not declared in this scope
/home/bakhaled/kernelmodules/Linux/../Linux/kbuild/../../Linux/video/devfb.cpp:272: erreur: 'devfbMutex' was not declared in this scope
/home/bakhaled/kernelmodules/Linux/../Linux/kbuild/../../Linux/video/devfb.cpp:275: erreur: 'CDisplayPlane' was not declared in this scope
/home/bakhaled/kernelmodules/Linux/../Linux/kbuild/../../Linux/video/devfb.cpp:275: erreur: expected primary-expression before ')' token
/home/bakhaled/kernelmodules/Linux/../Linux/kbuild/../../Linux/video/devfb.cpp:275: erreur: expected `)' before 'pPlane'
/home/bakhaled/kernelmodules/Linux/../Linux/kbuild/../../Linux/video/devfb.cpp:277: erreur: 'g_pIOS' was not declared in this scope
/home/bakhaled/kernelmodules/Linux/../Linux/kbuild/../../Linux/video/devfb.cpp:277: erreur: 'devfbMutex' was not declared in this scope
/home/bakhaled/kernelmodules/Linux/../Linux/kbuild/../../Linux/video/devfb.cpp: In function 'int DevfbWriteBuffer(void*, void*)':
/home/bakhaled/kernelmodules/Linux/../Linux/kbuild/../../Linux/video/devfb.cpp:287: erreur: 'ASSERTF' was not declared in this scope
/home/bakhaled/kernelmodules/Linux/../Linux/kbuild/../../Linux/video/devfb.cpp:289: erreur: 'g_pIOS' was not declared in this scope
/home/bakhaled/kernelmodules/Linux/../Linux/kbuild/../../Linux/video/devfb.cpp:289: erreur: 'devfbMutex' was not declared in this scope
/home/bakhaled/kernelmodules/Linux/../Linux/kbuild/../../Linux/video/devfb.cpp:292: erreur: 'CDisplayPlane' was not declared in this scope
/home/bakhaled/kernelmodules/Linux/../Linux/kbuild/../../Linux/video/devfb.cpp:292: erreur: expected primary-expression before ')' token
/home/bakhaled/kernelmodules/Linux/../Linux/kbuild/../../Linux/video/devfb.cpp:292: erreur: expected `)' before 'pOvl'
/home/bakhaled/kernelmodules/Linux/../Linux/kbuild/../../Linux/video/devfb.cpp:294: erreur: 'g_pIOS' was not declared in this scope
/home/bakhaled/kernelmodules/Linux/../Linux/kbuild/../../Linux/video/devfb.cpp:294: erreur: 'devfbMutex' was not declared in this scope
/home/bakhaled/kernelmodules/Linux/../Linux/kbuild/../../Linux/video/devfb.cpp: At global scope:
/home/bakhaled/kernelmodules/Linux/../Linux/kbuild/../../Linux/video/devfb.cpp:303: erreur: 'ULONG' does not name a type
/home/bakhaled/kernelmodules/Linux/../Linux/kbuild/../../Linux/video/devfb.cpp:319: erreur: 'UCHAR' has not been declared
/home/bakhaled/kernelmodules/Linux/../Linux/kbuild/../../Linux/video/devfb.cpp: In function 'void* DevfbGetOutput(void*, int)':
/home/bakhaled/kernelmodules/Linux/../Linux/kbuild/../../Linux/video/devfb.cpp:321: erreur: 'CDisplayDevice' was not declared in this scope
/home/bakhaled/kernelmodules/Linux/../Linux/kbuild/../../Linux/video/devfb.cpp:321: erreur: 'pDev' was not declared in this scope
/home/bakhaled/kernelmodules/Linux/../Linux/kbuild/../../Linux/video/devfb.cpp:321: erreur: expected primary-expression before ')' token
/home/bakhaled/kernelmodules/Linux/../Linux/kbuild/../../Linux/video/devfb.cpp:321: erreur: expected `;' before 'devptr'
/home/bakhaled/kernelmodules/Linux/../Linux/kbuild/../../Linux/video/devfb.cpp:324: erreur: 'g_pIOS' was not declared in this scope
/home/bakhaled/kernelmodules/Linux/../Linux/kbuild/../../Linux/video/devfb.cpp:324: erreur: 'devfbMutex' was not declared in this scope
/home/bakhaled/kernelmodules/Linux/../Linux/kbuild/../../Linux/video/devfb.cpp:329: erreur: 'g_pIOS' was not declared in this scope
/home/bakhaled/kernelmodules/Linux/../Linux/kbuild/../../Linux/video/devfb.cpp:329: erreur: 'devfbMutex' was not declared in this scope
/home/bakhaled/kernelmodules/Linux/../Linux/kbuild/../../Linux/video/devfb.cpp: At global scope:
/home/bakhaled/kernelmodules/Linux/../Linux/kbuild/../../Linux/video/devfb.cpp:335: erreur: 'ULONG' does not name a type
/home/bakhaled/kernelmodules/Linux/../Linux/kbuild/../../Linux/video/devfb.cpp:351: erreur: expected initializer before '*' token
/home/bakhaled/kernelmodules/Linux/../Linux/kbuild/../../Linux/video/devfb.cpp:367: erreur: expected initializer before '*' token
/home/bakhaled/kernelmodules/Linux/../Linux/kbuild/../../Linux/video/devfb.cpp:383: erreur: expected initializer before '*' token
/home/bakhaled/kernelmodules/Linux/../Linux/kbuild/../../Linux/video/devfb.cpp:399: erreur: expected ',' or '...' before '*' token
/home/bakhaled/kernelmodules/Linux/../Linux/kbuild/../../Linux/video/devfb.cpp:399: erreur: ISO C++ forbids declaration of 'stm_mode_line_t' with no type
/home/bakhaled/kernelmodules/Linux/../Linux/kbuild/../../Linux/video/devfb.cpp: In function 'int DevfbStartOutput(void*, int)':
/home/bakhaled/kernelmodules/Linux/../Linux/kbuild/../../Linux/video/devfb.cpp:401: erreur: 'COutput' was not declared in this scope
/home/bakhaled/kernelmodules/Linux/../Linux/kbuild/../../Linux/video/devfb.cpp:401: erreur: 'pOutput' was not declared in this scope
/home/bakhaled/kernelmodules/Linux/../Linux/kbuild/../../Linux/video/devfb.cpp:401: erreur: expected primary-expression before ')' token
/home/bakhaled/kernelmodules/Linux/../Linux/kbuild/../../Linux/video/devfb.cpp:401: erreur: expected `;' before 'outPtr'
/home/bakhaled/kernelmodules/Linux/../Linux/kbuild/../../Linux/video/devfb.cpp:404: erreur: 'g_pIOS' was not declared in this scope
/home/bakhaled/kernelmodules/Linux/../Linux/kbuild/../../Linux/video/devfb.cpp:404: erreur: 'devfbMutex' was not declared in this scope
/home/bakhaled/kernelmodules/Linux/../Linux/kbuild/../../Linux/video/devfb.cpp:407: erreur: 'pModeLine' was not declared in this scope
/home/bakhaled/kernelmodules/Linux/../Linux/kbuild/../../Linux/video/devfb.cpp:407: erreur: 'ulTVStandard' was not declared in this scope
/home/bakhaled/kernelmodules/Linux/../Linux/kbuild/../../Linux/video/devfb.cpp:409: erreur: 'g_pIOS' was not declared in this scope
/home/bakhaled/kernelmodules/Linux/../Linux/kbuild/../../Linux/video/devfb.cpp:409: erreur: 'devfbMutex' was not declared in this scope
/home/bakhaled/kernelmodules/Linux/../Linux/kbuild/../../Linux/video/devfb.cpp: In function 'int DevfbStopOutput(void*)':
/home/bakhaled/kernelmodules/Linux/../Linux/kbuild/../../Linux/video/devfb.cpp:417: erreur: 'COutput' was not declared in this scope
/home/bakhaled/kernelmodules/Linux/../Linux/kbuild/../../Linux/video/devfb.cpp:417: erreur: 'pOutput' was not declared in this scope
/home/bakhaled/kernelmodules/Linux/../Linux/kbuild/../../Linux/video/devfb.cpp:417: erreur: expected primary-expression before ')' token
/home/bakhaled/kernelmodules/Linux/../Linux/kbuild/../../Linux/video/devfb.cpp:417: erreur: expected `;' before 'outPtr'
/home/bakhaled/kernelmodules/Linux/../Linux/kbuild/../../Linux/video/devfb.cpp:420: erreur: 'g_pIOS' was not declared in this scope
/home/bakhaled/kernelmodules/Linux/../Linux/kbuild/../../Linux/video/devfb.cpp:420: erreur: 'devfbMutex' was not declared in this scope
/home/bakhaled/kernelmodules/Linux/../Linux/kbuild/../../Linux/video/devfb.cpp:425: erreur: 'g_pIOS' was not declared in this scope
/home/bakhaled/kernelmodules/Linux/../Linux/kbuild/../../Linux/video/devfb.cpp:425: erreur: 'devfbMutex' was not declared in this scope
/home/bakhaled/kernelmodules/Linux/../Linux/kbuild/../../Linux/video/devfb.cpp: In function 'int DevfbSuspendOutput(void*)':
/home/bakhaled/kernelmodules/Linux/../Linux/kbuild/../../Linux/video/devfb.cpp:433: erreur: 'COutput' was not declared in this scope
/home/bakhaled/kernelmodules/Linux/../Linux/kbuild/../../Linux/video/devfb.cpp:433: erreur: 'pOutput' was not declared in this scope
/home/bakhaled/kernelmodules/Linux/../Linux/kbuild/../../Linux/video/devfb.cpp:433: erreur: expected primary-expression before ')' token
/home/bakhaled/kernelmodules/Linux/../Linux/kbuild/../../Linux/video/devfb.cpp:433: erreur: expected `;' before 'outPtr'
/home/bakhaled/kernelmodules/Linux/../Linux/kbuild/../../Linux/video/devfb.cpp:435: erreur: 'g_pIOS' was not declared in this scope
/home/bakhaled/kernelmodules/Linux/../Linux/kbuild/../../Linux/video/devfb.cpp:435: erreur: 'devfbMutex' was not declared in this scope
/home/bakhaled/kernelmodules/Linux/../Linux/kbuild/../../Linux/video/devfb.cpp:440: erreur: 'g_pIOS' was not declared in this scope
/home/bakhaled/kernelmodules/Linux/../Linux/kbuild/../../Linux/video/devfb.cpp:440: erreur: 'devfbMutex' was not declared in this scope
/home/bakhaled/kernelmodules/Linux/../Linux/kbuild/../../Linux/video/devfb.cpp: In function 'int DevfbResumeOutput(void*)':
/home/bakhaled/kernelmodules/Linux/../Linux/kbuild/../../Linux/video/devfb.cpp:448: erreur: 'COutput' was not declared in this scope
/home/bakhaled/kernelmodules/Linux/../Linux/kbuild/../../Linux/video/devfb.cpp:448: erreur: 'pOutput' was not declared in this scope
/home/bakhaled/kernelmodules/Linux/../Linux/kbuild/../../Linux/video/devfb.cpp:448: erreur: expected primary-expression before ')' token
/home/bakhaled/kernelmodules/Linux/../Linux/kbuild/../../Linux/video/devfb.cpp:448: erreur: expected `;' before 'outPtr'
/home/bakhaled/kernelmodules/Linux/../Linux/kbuild/../../Linux/video/devfb.cpp:450: erreur: 'g_pIOS' was not declared in this scope
/home/bakhaled/kernelmodules/Linux/../Linux/kbuild/../../Linux/video/devfb.cpp:450: erreur: 'devfbMutex' was not declared in this scope
/home/bakhaled/kernelmodules/Linux/../Linux/kbuild/../../Linux/video/devfb.cpp:455: erreur: 'g_pIOS' was not declared in this scope
/home/bakhaled/kernelmodules/Linux/../Linux/kbuild/../../Linux/video/devfb.cpp:455: erreur: 'devfbMutex' was not declared in this scope
/home/bakhaled/kernelmodules/Linux/../Linux/kbuild/../../Linux/video/devfb.cpp: At global scope:
/home/bakhaled/kernelmodules/Linux/../Linux/kbuild/../../Linux/video/devfb.cpp:461: erreur: 'ULONG' has not been declared
/home/bakhaled/kernelmodules/Linux/../Linux/kbuild/../../Linux/video/devfb.cpp: In function 'int DevfbOutputSupportedControls(void*, int*)':
/home/bakhaled/kernelmodules/Linux/../Linux/kbuild/../../Linux/video/devfb.cpp:463: erreur: 'COutput' was not declared in this scope
/home/bakhaled/kernelmodules/Linux/../Linux/kbuild/../../Linux/video/devfb.cpp:463: erreur: 'pOut' was not declared in this scope
/home/bakhaled/kernelmodules/Linux/../Linux/kbuild/../../Linux/video/devfb.cpp:463: erreur: expected primary-expression before ')' token
/home/bakhaled/kernelmodules/Linux/../Linux/kbuild/../../Linux/video/devfb.cpp:463: erreur: expected `;' before 'pOutput'
/home/bakhaled/kernelmodules/Linux/../Linux/kbuild/../../Linux/video/devfb.cpp:465: erreur: 'g_pIOS' was not declared in this scope
/home/bakhaled/kernelmodules/Linux/../Linux/kbuild/../../Linux/video/devfb.cpp:465: erreur: 'devfbMutex' was not declared in this scope
/home/bakhaled/kernelmodules/Linux/../Linux/kbuild/../../Linux/video/devfb.cpp:470: erreur: 'g_pIOS' was not declared in this scope
/home/bakhaled/kernelmodules/Linux/../Linux/kbuild/../../Linux/video/devfb.cpp:470: erreur: 'devfbMutex' was not declared in this scope
/home/bakhaled/kernelmodules/Linux/../Linux/kbuild/../../Linux/video/devfb.cpp: At global scope:
/home/bakhaled/kernelmodules/Linux/../Linux/kbuild/../../Linux/video/devfb.cpp:476: erreur: 'stm_output_control_t' has not been declared
/home/bakhaled/kernelmodules/Linux/../Linux/kbuild/../../Linux/video/devfb.cpp:476: erreur: 'ULONG' has not been declared
/home/bakhaled/kernelmodules/Linux/../Linux/kbuild/../../Linux/video/devfb.cpp: In function 'int DevfbOutputSetControl(void*, int, int)':
/home/bakhaled/kernelmodules/Linux/../Linux/kbuild/../../Linux/video/devfb.cpp:478: erreur: 'COutput' was not declared in this scope
/home/bakhaled/kernelmodules/Linux/../Linux/kbuild/../../Linux/video/devfb.cpp:478: erreur: 'pOut' was not declared in this scope
/home/bakhaled/kernelmodules/Linux/../Linux/kbuild/../../Linux/video/devfb.cpp:478: erreur: expected primary-expression before ')' token
/home/bakhaled/kernelmodules/Linux/../Linux/kbuild/../../Linux/video/devfb.cpp:478: erreur: expected `;' before 'pOutput'
/home/bakhaled/kernelmodules/Linux/../Linux/kbuild/../../Linux/video/devfb.cpp:480: erreur: 'g_pIOS' was not declared in this scope
/home/bakhaled/kernelmodules/Linux/../Linux/kbuild/../../Linux/video/devfb.cpp:480: erreur: 'devfbMutex' was not declared in this scope
/home/bakhaled/kernelmodules/Linux/../Linux/kbuild/../../Linux/video/devfb.cpp:485: erreur: 'g_pIOS' was not declared in this scope
/home/bakhaled/kernelmodules/Linux/../Linux/kbuild/../../Linux/video/devfb.cpp:485: erreur: 'devfbMutex' was not declared in this scope
/home/bakhaled/kernelmodules/Linux/../Linux/kbuild/../../Linux/video/devfb.cpp: At global scope:
/home/bakhaled/kernelmodules/Linux/../Linux/kbuild/../../Linux/video/devfb.cpp:491: erreur: 'stm_output_control_t' has not been declared
/home/bakhaled/kernelmodules/Linux/../Linux/kbuild/../../Linux/video/devfb.cpp:491: erreur: 'ULONG' has not been declared
/home/bakhaled/kernelmodules/Linux/../Linux/kbuild/../../Linux/video/devfb.cpp: In function 'int DevfbOutputGetControl(void*, int, int*)':
/home/bakhaled/kernelmodules/Linux/../Linux/kbuild/../../Linux/video/devfb.cpp:493: erreur: 'COutput' was not declared in this scope
/home/bakhaled/kernelmodules/Linux/../Linux/kbuild/../../Linux/video/devfb.cpp:493: erreur: 'pOut' was not declared in this scope
/home/bakhaled/kernelmodules/Linux/../Linux/kbuild/../../Linux/video/devfb.cpp:493: erreur: expected primary-expression before ')' token
/home/bakhaled/kernelmodules/Linux/../Linux/kbuild/../../Linux/video/devfb.cpp:493: erreur: expected `;' before 'pOutput'
/home/bakhaled/kernelmodules/Linux/../Linux/kbuild/../../Linux/video/devfb.cpp:495: erreur: 'g_pIOS' was not declared in this scope
/home/bakhaled/kernelmodules/Linux/../Linux/kbuild/../../Linux/video/devfb.cpp:495: erreur: 'devfbMutex' was not declared in this scope
/home/bakhaled/kernelmodules/Linux/../Linux/kbuild/../../Linux/video/devfb.cpp:500: erreur: 'g_pIOS' was not declared in this scope
/home/bakhaled/kernelmodules/Linux/../Linux/kbuild/../../Linux/video/devfb.cpp:500: erreur: 'devfbMutex' was not declared in this scope
/home/bakhaled/kernelmodules/Linux/../Linux/kbuild/../../Linux/video/devfb.cpp: At global scope:
/home/bakhaled/kernelmodules/Linux/../Linux/kbuild/../../Linux/video/devfb.cpp:506: erreur: 'ULONG' has not been declared
/home/bakhaled/kernelmodules/Linux/../Linux/kbuild/../../Linux/video/devfb.cpp: In function 'int DevfbOutputSetFormat(void*, int)':
/home/bakhaled/kernelmodules/Linux/../Linux/kbuild/../../Linux/video/devfb.cpp:508: erreur: 'COutput' was not declared in this scope
/home/bakhaled/kernelmodules/Linux/../Linux/kbuild/../../Linux/video/devfb.cpp:508: erreur: 'pOut' was not declared in this scope
/home/bakhaled/kernelmodules/Linux/../Linux/kbuild/../../Linux/video/devfb.cpp:508: erreur: expected primary-expression before ')' token
/home/bakhaled/kernelmodules/Linux/../Linux/kbuild/../../Linux/video/devfb.cpp:508: erreur: expected `;' before 'pOutput'
/home/bakhaled/kernelmodules/Linux/../Linux/kbuild/../../Linux/video/devfb.cpp:511: erreur: 'g_pIOS' was not declared in this scope
/home/bakhaled/kernelmodules/Linux/../Linux/kbuild/../../Linux/video/devfb.cpp:511: erreur: 'devfbMutex' was not declared in this scope
/home/bakhaled/kernelmodules/Linux/../Linux/kbuild/../../Linux/video/devfb.cpp:516: erreur: 'g_pIOS' was not declared in this scope
/home/bakhaled/kernelmodules/Linux/../Linux/kbuild/../../Linux/video/devfb.cpp:516: erreur: 'devfbMutex' was not declared in this scope
/home/bakhaled/kernelmodules/Linux/../Linux/kbuild/../../Linux/video/devfb.cpp: At global scope:
/home/bakhaled/kernelmodules/Linux/../Linux/kbuild/../../Linux/video/devfb.cpp:522: erreur: 'ULONG' has not been declared
/home/bakhaled/kernelmodules/Linux/../Linux/kbuild/../../Linux/video/devfb.cpp: In function 'int DevfbOutputGetFormat(void*, int*)':
/home/bakhaled/kernelmodules/Linux/../Linux/kbuild/../../Linux/video/devfb.cpp:524: erreur: 'COutput' was not declared in this scope
/home/bakhaled/kernelmodules/Linux/../Linux/kbuild/../../Linux/video/devfb.cpp:524: erreur: 'pOut' was not declared in this scope
/home/bakhaled/kernelmodules/Linux/../Linux/kbuild/../../Linux/video/devfb.cpp:524: erreur: expected primary-expression before ')' token
/home/bakhaled/kernelmodules/Linux/../Linux/kbuild/../../Linux/video/devfb.cpp:524: erreur: expected `;' before 'pOutput'
/home/bakhaled/kernelmodules/Linux/../Linux/kbuild/../../Linux/video/devfb.cpp:526: erreur: 'g_pIOS' was not declared in this scope
/home/bakhaled/kernelmodules/Linux/../Linux/kbuild/../../Linux/video/devfb.cpp:526: erreur: 'devfbMutex' was not declared in this scope
/home/bakhaled/kernelmodules/Linux/../Linux/kbuild/../../Linux/video/devfb.cpp:531: erreur: 'g_pIOS' was not declared in this scope
/home/bakhaled/kernelmodules/Linux/../Linux/kbuild/../../Linux/video/devfb.cpp:531: erreur: 'devfbMutex' was not declared in this scope
/home/bakhaled/kernelmodules/Linux/../Linux/kbuild/../../Linux/video/devfb.cpp: At global scope:
/home/bakhaled/kernelmodules/Linux/../Linux/kbuild/../../Linux/video/devfb.cpp:537: erreur: 'ULONG' has not been declared
/home/bakhaled/kernelmodules/Linux/../Linux/kbuild/../../Linux/video/devfb.cpp: In function 'int DevfbOutputSetInputSource(void*, int)':
/home/bakhaled/kernelmodules/Linux/../Linux/kbuild/../../Linux/video/devfb.cpp:539: erreur: 'COutput' was not declared in this scope
/home/bakhaled/kernelmodules/Linux/../Linux/kbuild/../../Linux/video/devfb.cpp:539: erreur: 'pOut' was not declared in this scope
/home/bakhaled/kernelmodules/Linux/../Linux/kbuild/../../Linux/video/devfb.cpp:539: erreur: expected primary-expression before ')' token
/home/bakhaled/kernelmodules/Linux/../Linux/kbuild/../../Linux/video/devfb.cpp:539: erreur: expected `;' before 'pOutput'
/home/bakhaled/kernelmodules/Linux/../Linux/kbuild/../../Linux/video/devfb.cpp:542: erreur: 'g_pIOS' was not declared in this scope
/home/bakhaled/kernelmodules/Linux/../Linux/kbuild/../../Linux/video/devfb.cpp:542: erreur: 'devfbMutex' was not declared in this scope
/home/bakhaled/kernelmodules/Linux/../Linux/kbuild/../../Linux/video/devfb.cpp:547: erreur: 'g_pIOS' was not declared in this scope
/home/bakhaled/kernelmodules/Linux/../Linux/kbuild/../../Linux/video/devfb.cpp:547: erreur: 'devfbMutex' was not declared in this scope
/home/bakhaled/kernelmodules/Linux/../Linux/kbuild/../../Linux/video/devfb.cpp: At global scope:
/home/bakhaled/kernelmodules/Linux/../Linux/kbuild/../../Linux/video/devfb.cpp:553: erreur: 'ULONG' has not been declared
/home/bakhaled/kernelmodules/Linux/../Linux/kbuild/../../Linux/video/devfb.cpp: In function 'int DevfbOutputGetInputSource(void*, int*)':
/home/bakhaled/kernelmodules/Linux/../Linux/kbuild/../../Linux/video/devfb.cpp:555: erreur: 'COutput' was not declared in this scope
/home/bakhaled/kernelmodules/Linux/../Linux/kbuild/../../Linux/video/devfb.cpp:555: erreur: 'pOut' was not declared in this scope
/home/bakhaled/kernelmodules/Linux/../Linux/kbuild/../../Linux/video/devfb.cpp:555: erreur: expected primary-expression before ')' token
/home/bakhaled/kernelmodules/Linux/../Linux/kbuild/../../Linux/video/devfb.cpp:555: erreur: expected `;' before 'pOutput'
/home/bakhaled/kernelmodules/Linux/../Linux/kbuild/../../Linux/video/devfb.cpp:557: erreur: 'g_pIOS' was not declared in this scope
/home/bakhaled/kernelmodules/Linux/../Linux/kbuild/../../Linux/video/devfb.cpp:557: erreur: 'devfbMutex' was not declared in this scope
/home/bakhaled/kernelmodules/Linux/../Linux/kbuild/../../Linux/video/devfb.cpp:562: erreur: 'g_pIOS' was not declared in this scope
/home/bakhaled/kernelmodules/Linux/../Linux/kbuild/../../Linux/video/devfb.cpp:562: erreur: 'devfbMutex' was not declared in this scope
/home/bakhaled/kernelmodules/Linux/../Linux/kbuild/../../Linux/video/devfb.cpp: At global scope:
/home/bakhaled/kernelmodules/Linux/../Linux/kbuild/../../Linux/video/devfb.cpp:568: erreur: 'ULONG' has not been declared
/home/bakhaled/kernelmodules/Linux/../Linux/kbuild/../../Linux/video/devfb.cpp: In function 'int DevfbOutputGetCurrentTVStandard(void*, int*)':
/home/bakhaled/kernelmodules/Linux/../Linux/kbuild/../../Linux/video/devfb.cpp:570: erreur: 'COutput' was not declared in this scope
/home/bakhaled/kernelmodules/Linux/../Linux/kbuild/../../Linux/video/devfb.cpp:570: erreur: 'pOut' was not declared in this scope
/home/bakhaled/kernelmodules/Linux/../Linux/kbuild/../../Linux/video/devfb.cpp:570: erreur: expected primary-expression before ')' token
/home/bakhaled/kernelmodules/Linux/../Linux/kbuild/../../Linux/video/devfb.cpp:570: erreur: expected `;' before 'pOutput'
/home/bakhaled/kernelmodules/Linux/../Linux/kbuild/../../Linux/video/devfb.cpp:572: erreur: 'g_pIOS' was not declared in this scope
/home/bakhaled/kernelmodules/Linux/../Linux/kbuild/../../Linux/video/devfb.cpp:572: erreur: 'devfbMutex' was not declared in this scope
/home/bakhaled/kernelmodules/Linux/../Linux/kbuild/../../Linux/video/devfb.cpp:577: erreur: 'g_pIOS' was not declared in this scope
/home/bakhaled/kernelmodules/Linux/../Linux/kbuild/../../Linux/video/devfb.cpp:577: erreur: 'devfbMutex' was not declared in this scope
/home/bakhaled/kernelmodules/Linux/../Linux/kbuild/../../Linux/video/devfb.cpp: At global scope:
/home/bakhaled/kernelmodules/Linux/../Linux/kbuild/../../Linux/video/devfb.cpp:583: erreur: 'stm_display_status_t' has not been declared
/home/bakhaled/kernelmodules/Linux/../Linux/kbuild/../../Linux/video/devfb.cpp: In function 'int DevfbOtuputGetDisplayStatus(void*, int*)':
/home/bakhaled/kernelmodules/Linux/../Linux/kbuild/../../Linux/video/devfb.cpp:585: erreur: 'COutput' was not declared in this scope
/home/bakhaled/kernelmodules/Linux/../Linux/kbuild/../../Linux/video/devfb.cpp:585: erreur: 'pOut' was not declared in this scope
/home/bakhaled/kernelmodules/Linux/../Linux/kbuild/../../Linux/video/devfb.cpp:585: erreur: expected primary-expression before ')' token
/home/bakhaled/kernelmodules/Linux/../Linux/kbuild/../../Linux/video/devfb.cpp:585: erreur: expected `;' before 'pOutput'
/home/bakhaled/kernelmodules/Linux/../Linux/kbuild/../../Linux/video/devfb.cpp: At global scope:
/home/bakhaled/kernelmodules/Linux/../Linux/kbuild/../../Linux/video/devfb.cpp:599: erreur: redefinition of 'void* DevfbCreateSurface'
/home/bakhaled/kernelmodules/Linux/../Linux/kbuild/../../Linux/video/devfb.h:109: erreur: 'void* DevfbCreateSurface' previously defined here
/home/bakhaled/kernelmodules/Linux/../Linux/kbuild/../../Linux/video/devfb.cpp:599: erreur: 'ULONG' was not declared in this scope
/home/bakhaled/kernelmodules/Linux/../Linux/kbuild/../../Linux/video/devfb.cpp:599: erreur: 'ULONG' was not declared in this scope
/home/bakhaled/kernelmodules/Linux/../Linux/kbuild/../../Linux/video/devfb.cpp:600: erreur: 'ULONG' was not declared in this scope
/home/bakhaled/kernelmodules/Linux/../Linux/kbuild/../../Linux/video/devfb.cpp:600: erreur: 'ULONG' was not declared in this scope
/home/bakhaled/kernelmodules/Linux/../Linux/kbuild/../../Linux/video/devfb.cpp:601: erreur: 'ULONG' was not declared in this scope
/home/bakhaled/kernelmodules/Linux/../Linux/kbuild/../../Linux/video/devfb.cpp:601: erreur: 'SURF_FMT' was not declared in this scope
/home/bakhaled/kernelmodules/Linux/../Linux/kbuild/../../Linux/video/devfb.cpp: In function 'void DevfbFreeSurface(void*)':
/home/bakhaled/kernelmodules/Linux/../Linux/kbuild/../../Linux/video/devfb.cpp:617: erreur: 'CGALSurf' was not declared in this scope
/home/bakhaled/kernelmodules/Linux/../Linux/kbuild/../../Linux/video/devfb.cpp:617: erreur: expected primary-expression before ')' token
/home/bakhaled/kernelmodules/Linux/../Linux/kbuild/../../Linux/video/devfb.cpp:617: erreur: expected `;' before 'surface'
/home/bakhaled/kernelmodules/Linux/../Linux/kbuild/../../Linux/video/devfb.cpp: At global scope:
/home/bakhaled/kernelmodules/Linux/../Linux/kbuild/../../Linux/video/devfb.cpp:624: erreur: 'stm_field_t' does not name a type
/home/bakhaled/kernelmodules/Linux/../Linux/kbuild/../../Linux/video/devfb.cpp: In function 'void DevfbHandleBlitterInterrupt(int, void*, pt_regs*)':
/home/bakhaled/kernelmodules/Linux/../Linux/kbuild/../../Linux/video/devfb.cpp:640: erreur: 'CDisplayDevice' was not declared in this scope
/home/bakhaled/kernelmodules/Linux/../Linux/kbuild/../../Linux/video/devfb.cpp:640: erreur: 'devptr' was not declared in this scope
/home/bakhaled/kernelmodules/Linux/../Linux/kbuild/../../Linux/video/devfb.cpp:640: erreur: expected primary-expression before ')' token
/home/bakhaled/kernelmodules/Linux/../Linux/kbuild/../../Linux/video/devfb.cpp:640: erreur: expected `;' before 'pDev'
/home/bakhaled/kernelmodules/Linux/../Linux/kbuild/../../Linux/video/devfb.cpp:642: erreur: 'ASSERTF' was not declared in this scope
/home/bakhaled/kernelmodules/Linux/../Linux/kbuild/../../Linux/video/devfb.cpp: In function 'void DevfbHandleHDMIInterrupt(void*)':
/home/bakhaled/kernelmodules/Linux/../Linux/kbuild/../../Linux/video/devfb.cpp:649: erreur: 'COutput' was not declared in this scope
/home/bakhaled/kernelmodules/Linux/../Linux/kbuild/../../Linux/video/devfb.cpp:649: erreur: 'output' was not declared in this scope
/home/bakhaled/kernelmodules/Linux/../Linux/kbuild/../../Linux/video/devfb.cpp:649: erreur: expected primary-expression before ')' token
/home/bakhaled/kernelmodules/Linux/../Linux/kbuild/../../Linux/video/devfb.cpp:649: erreur: expected `;' before 'pOut'
/home/bakhaled/kernelmodules/Linux/../Linux/kbuild/../../Linux/video/devfb.cpp:651: erreur: 'ASSERTF' was not declared in this scope
/home/bakhaled/kernelmodules/Linux/../Linux/kbuild/../../Linux/video/devfb.cpp: In function 'void DevfbUpdateDisplay(void*, void*)':
/home/bakhaled/kernelmodules/Linux/../Linux/kbuild/../../Linux/video/devfb.cpp:661: erreur: 'CDisplayDevice' was not declared in this scope
/home/bakhaled/kernelmodules/Linux/../Linux/kbuild/../../Linux/video/devfb.cpp:661: erreur: 'devptr' was not declared in this scope
/home/bakhaled/kernelmodules/Linux/../Linux/kbuild/../../Linux/video/devfb.cpp:661: erreur: expected primary-expression before ')' token
/home/bakhaled/kernelmodules/Linux/../Linux/kbuild/../../Linux/video/devfb.cpp:661: erreur: expected `;' before 'pDev'
/home/bakhaled/kernelmodules/Linux/../Linux/kbuild/../../Linux/video/devfb.cpp:662: erreur: 'COutput' was not declared in this scope
/home/bakhaled/kernelmodules/Linux/../Linux/kbuild/../../Linux/video/devfb.cpp:662: erreur: 'output' was not declared in this scope
/home/bakhaled/kernelmodules/Linux/../Linux/kbuild/../../Linux/video/devfb.cpp:662: erreur: expected primary-expression before ')' token
/home/bakhaled/kernelmodules/Linux/../Linux/kbuild/../../Linux/video/devfb.cpp:662: erreur: expected `;' before 'pOut'
/home/bakhaled/kernelmodules/Linux/../Linux/kbuild/../../Linux/video/devfb.cpp:664: erreur: 'ASSERTF' was not declared in this scope
/home/bakhaled/kernelmodules/Linux/../Linux/kbuild/../../Linux/video/devfb.cpp: In function 'void* operator new(unsigned int)':
/home/bakhaled/kernelmodules/Linux/../Linux/kbuild/../../Linux/video/devfb.cpp:677: erreur: 'g_pIOS' was not declared in this scope
/home/bakhaled/kernelmodules/Linux/../Linux/kbuild/../../Linux/video/devfb.cpp: In function 'void operator delete(void*)':
/home/bakhaled/kernelmodules/Linux/../Linux/kbuild/../../Linux/video/devfb.cpp:686: erreur: 'g_pIOS' was not declared in this scope
/home/bakhaled/kernelmodules/Linux/../Linux/kbuild/../../Linux/video/devfb.cpp: In function 'void* operator new [](unsigned int)':
/home/bakhaled/kernelmodules/Linux/../Linux/kbuild/../../Linux/video/devfb.cpp:695: erreur: 'g_pIOS' was not declared in this scope
/home/bakhaled/kernelmodules/Linux/../Linux/kbuild/../../Linux/video/devfb.cpp: In function 'void operator delete [](void*)':
/home/bakhaled/kernelmodules/Linux/../Linux/kbuild/../../Linux/video/devfb.cpp:704: erreur: 'g_pIOS' was not declared in this scope
make[2]: *** [/home/bakhaled/kernelmodules/Linux/../Linux/kbuild/../../Linux/video/devfb.o] Erreur 1
make[1]: *** [_module_/home/bakhaled/kernelmodules/Linux/../Linux/kbuild] Erreur 2
make[1]: quittant le répertoire « /home/bakhaled/Documents/linux-2.6.17.14_stm22_0037 »
make: *** [modules] Erreur 2

 

First of all, you'd start posting a log of the compilation process
containing the exact error messages...

MfG, JBG

--
     Jan-Benedict Glaw      jbglaw@lug-owl.de              +49-172-7608481
Signature of:               The real problem with C++ for kernel modules is:
the second  :                                 the language just sucks.
                                                  -- Linus Torvalds

-----BEGIN PGP SIGNATURE-----
Version: GnuPG v1.4.6 (GNU/Linux)

iD8DBQFIka0vHb1edYOZ4bsRAiqRAJ9Es0v+0bcgV4hg7GvAMJvZTPDAygCfYBF6
FXoz0cHpD9/tU1427iz3iQ8=
=AXTS
-----END PGP SIGNATURE-----




--
amicalement
khaled