On Sat, Oct 27, 2012 at 10:09 AM, Roy Stogner <roystgnr@ices.utexas.edu> wrote:
src/base/dof_map_constraints.C:2875: error: ‘mesh’ was not declared in this scope
make: *** [src/base/dof_map_constraints.x86_64-apple-darwin11.4.2.opt.o] Error 1

Should be fixed in r6227, thanks.

Hmmm... I'm still getting this:

src/base/dof_map_constraints.C: In member function ‘void libMesh::DofMap::scatter_constraints(libMesh::MeshBase&)’:
src/base/dof_map_constraints.C:2871: error: ‘mesh’ was not declared in this scope
make: *** [src/base/dof_map_constraints.x86_64-apple-darwin11.4.2.opt.o] Error 1