• Thomas Bruns

    Thomas Bruns - 2001-04-02

    Hi !

    I tried to compile "ksiemens", but filebrowser.cpp does not compile because kfilereader.h, kfiledetailview.h and kcombobox.h were not found. Is there some specific kde- or qt-version I must have ?!? I'm using KDE 2.1 and qt-2.2.4.

    • Matthias Welwarsky

      Hi Thomas,

      kde 2.1 and qt 2.2.4 should be sufficient. Did you compile kde from source? if not, check if you have the header files installed at all. Some distributors split libraries and header files and put the header files into "devel" packages.

    • Roberto Polli

      Roberto Polli - 2002-02-03

      It won't compile.
      The error is:
      In file included from /usr/lib/qt2/include/qwindowdefs.h:48,
                       from /usr/lib/qt2/include/qwidget.h:42,
                       from /usr/lib/qt2/include/qframe.h:42,
                       from /usr/lib/qt2/include/qscrollview.h:41,
                       from /usr/lib/qt2/include/qlistview.h:51,
                       from /usr/include/klistview.h:23,
                       from phonebookcontrol.cpp:20:
      /usr/include/limits.h:124:3: warning: #include_next is a GCC extension
      phonebookcontrol.cpp: In method `void PhoneBookControl::deliverMessage
      phonebookcontrol.cpp:99: no match for `PhoneBookControl::PhoneBook & +=
      phonebookcontrol.cpp:167: no match for `PhoneBookControl::PhoneBook &
      += int'
      phonebookcontrol.cpp: In method `void
      PhoneBookControl::synchronizeBooks ()':
      phonebookcontrol.cpp:268: no match for `PhoneBookControl::PhoneBook &
      += int'
      make[2]: *** [phonebookcontrol.o] Error 1
      make[2]: Leaving directory `/home/rob/tar/ksiemens-0.2/ksiemens'
      make[1]: *** [all-recursive] Error 1
      make[1]: Leaving directory `/home/rob/tar/ksiemens-0.2'
      make: *** [all-recursive-am] Error 2

      I've got kde 2.2.1 with Mandrake 8.1


Log in to post a comment.