michael - 2004-11-12

Hi!

After typing

export QTDIR=/usr/lib/qt3/lib64

and invoking

./configure --prefix=/opt/kde3 --with-qtdir=/usr/lib64/qt3 --with-qt-libraries=/usr/lib64/qt3/lib64 --with-extra-libs=/usr/lib64 --enable-libsuffix=64

with no error mesages

I invoked make  TARGET_ARCH=-m64

and got following (error) messages:

make  all-recursive
make[1]: Entering directory `/space4/sw2/komport/komport-0.5.3'
Making all in komport
make[2]: Entering directory `/space4/sw2/komport/komport-0.5.3/komport'
c++ -DHAVE_CONFIG_H -I. -I. -I.. -I/opt/kde3/include -I/usr/lib/qt3/include -I/usr/X11R6/include   -DQT_THREAD_SUPPORT  -D_REENTRANT  -O2 -fno-exceptions -fno-check-new  -c komportfilescrollbuffer.cpp
c++ -DHAVE_CONFIG_H -I. -I. -I.. -I/opt/kde3/include -I/usr/lib/qt3/include -I/usr/X11R6/include   -DQT_THREAD_SUPPORT  -D_REENTRANT  -O2 -fno-exceptions -fno-check-new  -c komporttransfer.cpp
komporttransfer.cpp: In member function `virtual bool
   KomportTransfer::setURL(KURL)':
komporttransfer.cpp:35: warning: `download' is deprecated (declared at
   /opt/kde3/include/kio/netaccess.h:115)
c++ -DHAVE_CONFIG_H -I. -I. -I.. -I/opt/kde3/include -I/usr/lib/qt3/include -I/usr/X11R6/include   -DQT_THREAD_SUPPORT  -D_REENTRANT  -O2 -fno-exceptions -fno-check-new  -c komportscrollbuffer.cpp
c++ -DHAVE_CONFIG_H -I. -I. -I.. -I/opt/kde3/include -I/usr/lib/qt3/include -I/usr/X11R6/include   -DQT_THREAD_SUPPORT  -D_REENTRANT  -O2 -fno-exceptions -fno-check-new  -c komportscript.cpp
c++ -DHAVE_CONFIG_H -I. -I. -I.. -I/opt/kde3/include -I/usr/lib/qt3/include -I/usr/X11R6/include   -DQT_THREAD_SUPPORT  -D_REENTRANT  -O2 -fno-exceptions -fno-check-new  -c komportemulation.cpp
c++ -DHAVE_CONFIG_H -I. -I. -I.. -I/opt/kde3/include -I/usr/lib/qt3/include -I/usr/X11R6/include   -DQT_THREAD_SUPPORT  -D_REENTRANT  -O2 -fno-exceptions -fno-check-new  -c komportqueue.cpp
c++ -DHAVE_CONFIG_H -I. -I. -I.. -I/opt/kde3/include -I/usr/lib/qt3/include -I/usr/X11R6/include   -DQT_THREAD_SUPPORT  -D_REENTRANT  -O2 -fno-exceptions -fno-check-new  -c komportcellarray.cpp
c++ -DHAVE_CONFIG_H -I. -I. -I.. -I/opt/kde3/include -I/usr/lib/qt3/include -I/usr/X11R6/include   -DQT_THREAD_SUPPORT  -D_REENTRANT  -O2 -fno-exceptions -fno-check-new  -c komportcell.cpp
c++ -DHAVE_CONFIG_H -I. -I. -I.. -I/opt/kde3/include -I/usr/lib/qt3/include -I/usr/X11R6/include   -DQT_THREAD_SUPPORT  -D_REENTRANT  -O2 -fno-exceptions -fno-check-new  -c komportserial.cpp
c++ -DHAVE_CONFIG_H -I. -I. -I.. -I/opt/kde3/include -I/usr/lib/qt3/include -I/usr/X11R6/include   -DQT_THREAD_SUPPORT  -D_REENTRANT  -O2 -fno-exceptions -fno-check-new  -c komportview.cpp
c++ -DHAVE_CONFIG_H -I. -I. -I.. -I/opt/kde3/include -I/usr/lib/qt3/include -I/usr/X11R6/include   -DQT_THREAD_SUPPORT  -D_REENTRANT  -O2 -fno-exceptions -fno-check-new  -c komportdoc.cpp
komportdoc.cpp: In member function `bool KomportDoc::openDocument(const KURL&,
   const char*)':
komportdoc.cpp:150: warning: `download' is deprecated (declared at
   /opt/kde3/include/kio/netaccess.h:115)
c++ -DHAVE_CONFIG_H -I. -I. -I.. -I/opt/kde3/include -I/usr/lib/qt3/include -I/usr/X11R6/include   -DQT_THREAD_SUPPORT  -D_REENTRANT  -O2 -fno-exceptions -fno-check-new  -c komport.cpp
c++ -DHAVE_CONFIG_H -I. -I. -I.. -I/opt/kde3/include -I/usr/lib/qt3/include -I/usr/X11R6/include   -DQT_THREAD_SUPPORT  -D_REENTRANT  -O2 -fno-exceptions -fno-check-new  -c main.cpp
/usr/lib/qt3/bin/moc settingsdialog.h -o settingsdialog.moc
rm -f settingsdialog.cpp
echo '#include <klocale.h>' > settingsdialog.cpp
/usr/lib/qt3/bin/uic -L /opt/kde3/lib/kde3/plugins/designer -nounload -tr tr2i18n -i settingsdialog.h ./settingsdialog.ui | sed -e "s,tr2i18n( \&quot;\&quot; ),QString::null,g" | sed -e "s,tr2i18n( \&quot;\&quot;\, \&quot;\&quot; ),QString::null,g" | sed -e "s,image\([0-9][0-9]*\)_data,img\1_settingsdialog,g" >> settingsdialog.cpp || rm -f settingsdialog.cpp
echo '#include "settingsdialog.moc"' >> settingsdialog.cpp
c++ -DHAVE_CONFIG_H -I. -I. -I.. -I/opt/kde3/include -I/usr/lib/qt3/include -I/usr/X11R6/include   -DQT_THREAD_SUPPORT  -D_REENTRANT  -O2 -fno-exceptions -fno-check-new  -c settingsdialog.cpp
settingsdialog.cpp: In constructor `SettingsDialog::SettingsDialog(QWidget*,
   const char*, bool, unsigned int)':
settingsdialog.cpp:200: error: `Horizontal_Spacing2' undeclared (first use this
   function)
settingsdialog.cpp:200: error: (Each undeclared identifier is reported only
   once for each function it appears in.)
make[2]: *** [settingsdialog.o] Error 1
make[2]: Leaving directory `/space4/sw2/komport/komport-0.5.3/komport'
make[1]: *** [all-recursive] Error 1
make[1]: Leaving directory `/space4/sw2/komport/komport-0.5.3'
make: *** [all-recursive-am] Error 2
gens@mellig:/space4/sw2/komport/komport-0.5.3> export QTDIR=/usr/lib/qt3/lib64
gens@mellig:/space4/sw2/komport/komport-0.5.3> make  TARGET_ARCH=-m64
make  all-recursive
make[1]: Entering directory `/space4/sw2/komport/komport-0.5.3'
Making all in komport
make[2]: Entering directory `/space4/sw2/komport/komport-0.5.3/komport'
c++ -DHAVE_CONFIG_H -I. -I. -I.. -I/opt/kde3/include -I/usr/lib/qt3/include -I/usr/X11R6/include   -DQT_THREAD_SUPPORT  -D_REENTRANT  -O2 -fno-exceptions -fno-check-new  -c settingsdialog.cpp
settingsdialog.cpp: In constructor `SettingsDialog::SettingsDialog(QWidget*,
   const char*, bool, unsigned int)':
settingsdialog.cpp:200: error: `Horizontal_Spacing2' undeclared (first use this
   function)
settingsdialog.cpp:200: error: (Each undeclared identifier is reported only
   once for each function it appears in.)
make[2]: *** [settingsdialog.o] Error 1
make[2]: Leaving directory `/space4/sw2/komport/komport-0.5.3/komport'
make[1]: *** [all-recursive] Error 1
make[1]: Leaving directory `/space4/sw2/komport/komport-0.5.3'
make: *** [all-recursive-am] Error 2

What can I do to avoid / correct  this error?

Thank you in advance for your help!!