#24 Build failure: bash: line 15: --destdir: command not found

v1.0 (example)
closed-fixed
nobody
None
9
2015-03-23
2012-03-01
quadrispro
No

Hi,

On Debian Wheezy and Ubuntu 12.04 Precise Pangolin idjc does not build anymore.
An excerpt of the buildlog follows:

__init__.pyprofiledialog.py
make[5]: Leaving directory `/build/buildd/idjc-0.8.7/python/prelims'
make[4]: Leaving directory `/build/buildd/idjc-0.8.7/python/prelims'
make[4]: Entering directory `/build/buildd/idjc-0.8.7/python'
make[5]: Entering directory `/build/buildd/idjc-0.8.7/python'
make[5]: Nothing to be done for `install-exec-am'.
sed -e 's|${pkgdatadir}|/usr/share/idjc|' -e 's|${exec_prefix}|/usr|' -e 's|${prefix}|/usr|' __init__.py.in >__init__.py
test -z "/usr/lib/python2.7/dist-packages/idjc" || /bin/mkdir -p "/build/buildd/idjc-0.8.7/debian/idjc/usr/lib/python2.7/dist-packages/idjc"
/usr/bin/install -c -m 644 __init__.py '/build/buildd/idjc-0.8.7/debian/idjc/usr/lib/python2.7/dist-packages/idjc'
/bin/bash: line 15: --destdir: command not found
make[5]: *** [install-nodist_pkgpythonPYTHON] Error 127
make[5]: Leaving directory `/build/buildd/idjc-0.8.7/python'
make[4]: *** [install-am] Error 2
make[4]: Leaving directory `/build/buildd/idjc-0.8.7/python'
make[3]: *** [install-recursive] Error 1
make[3]: Leaving directory `/build/buildd/idjc-0.8.7/python'
make[2]: *** [install-recursive] Error 1
make[2]: Leaving directory `/build/buildd/idjc-0.8.7'
dh_auto_install: make -j1 install DESTDIR=/build/buildd/idjc-0.8.7/debian/idjc returned exit code 2
make[1]: *** [override_dh_auto_install] Error 29
make[1]: Leaving directory `/build/buildd/idjc-0.8.7'
make: *** [binary] Error 2

A full buildlog is available here: https://launchpadlibrarian.net/92762857/buildlog_ubuntu-precise-i386.idjc_0.8.7-1_FAILEDTOBUILD.txt.gz
This bug was originally reported on Ubuntu: https://launchpad.net/bugs/935507.
This bug was reported to Debian too: http://bugs.debian.org/cgi-bin/bugreport.cgi?bug=661605

Discussion

  • quadrispro

    quadrispro - 2012-03-01
    • priority: 5 --> 9
     
  • Stephen Fairchild

    • status: open --> open-fixed
     
  • Stephen Fairchild

    Traced to undefined symbol am__py_compile which is now manually set in python/Makefile.am in git sources.

    It now installs but has serious menu issues with Unity.

     
  • Stephen Fairchild

    • status: open-fixed --> closed-fixed
    • Group: --> v1.0 (example)
     

Log in to post a comment.