I'm having a similiar problem when building any gumstix image (omap3-console-image, palmtop-image, etc.).  Everything was working fine before my latest git pull, now nothing builds!  My dev machine is running ubuntu 10.04 on x86_64.  I have no clue how to debug this.  Any help would be much appreciated. This is a dump of the error I'm seeing:

david@sadhu:~/overo-new$ bitbake omap3-palmtop-image
NOTE: Handling BitBake files: | (7101/7101) [100 %]
NOTE: Parsing finished. 6383 cached, 413 parsed, 305 skipped, 2 masked.
NOTE: Resolving any missing task queue dependencies
NOTE: Preparing runqueue
NOTE: Executing runqueue
NOTE: Running task 300 of 7604 (ID: 144, /home/david/overo-new/org.openembedded.dev/recipes/glibc/glibc_2.9.bb, do_compile)
ERROR: function do_compile failed
ERROR: log data follows (/home/david/overo-new/tmp/work/armv7a-angstrom-linux-gnueabi/glibc-2.9-r37.3/temp/log.do_compile.3483)
| NOTE: make rootsbindir=/sbin
| make -r PARALLELMFLAGS="" CVSOPTS="" -C /home/david/overo-new/tmp/work/armv7a-angstrom-linux-gnueabi/glibc-2.9-r37.3/glibc-2.9 objdir=`pwd` all
| make[1]: Entering directory `/home/david/overo-new/tmp/work/armv7a-angstrom-linux-gnueabi/glibc-2.9-r37.3/glibc-2.9'
| { echo '#include "posix/bits/posix1_lim.h"';        \
|       echo '#define _LIBC 1';                    \
|       echo '#include "misc/sys/uio.h"'; } |            \
|     arm-angstrom-linux-gnueabi-gcc -march=armv7-a -mtune=cortex-a8 -mfpu=neon -mfloat-abi=softfp -mthumb-interwork -mno-thumb -E -dM -MD -MP -MF /home/david/overo-new/tmp/work/armv7a-angstrom-linux-gnueabi/glibc-2.9-r37.3/build-arm-angstrom-linux-gnueabi/bits/stdio_lim.dT -MT '/home/david/overo-new/tmp/work/armv7a-angstrom-linux-gnueabi/glibc-2.9-r37.3/build-arm-angstrom-linux-gnueabi/bits/stdio_lim.h /home/david/overo-new/tmp/work/armv7a-angstrom-linux-gnueabi/glibc-2.9-r37.3/build-arm-angstrom-linux-gnueabi/bits/stdio_lim.d'     \
|           -Iinclude  -I/home/david/overo-new/tmp/work/armv7a-angstrom-linux-gnueabi/glibc-2.9-r37.3/build-arm-angstrom-linux-gnueabi -Iports/sysdeps/arm/elf -Iports/sysdeps/unix/sysv/linux/arm/eabi/nptl -Iports/sysdeps/unix/sysv/linux/arm/eabi -Isysdeps/unix/sysv/linux/arm/eabi -Iports/sysdeps/unix/sysv/linux/arm/nptl -Iports/sysdeps/unix/sysv/linux/arm -Isysdeps/unix/sysv/linux/arm -Iports/sysdeps/unix/sysv/linux -Inptl/sysdeps/unix/sysv/linux -Inptl/sysdeps/pthread -Isysdeps/pthread -Isysdeps/unix/sysv/linux -Isysdeps/gnu -Isysdeps/unix/common -Isysdeps/unix/mman -Isysdeps/unix/inet -Iports/sysdeps/unix/sysv -Inptl/sysdeps/unix/sysv -Isysdeps/unix/sysv -Iports/sysdeps/unix/arm -Iports/sysdeps/unix -Inptl/sysdeps/unix -Isysdeps/unix -Isysdeps/posix -Iports/sysdeps/arm/eabi -Iports/sysdeps/arm/fpu -Iports/sysdeps/arm/nptl -Iports/sysdeps/arm -Isysdeps/wordsize-32 -Isysdeps/ieee754/flt-32 -Isysdeps/ieee754/dbl-64 -Isysdeps/ieee754 -Isysdeps/generic/elf -Isysdeps/generic -Iports -Inptl   -Ilibio -I. -nostdinc -isystem /home/david/overo-new/tmp/sysroots/x86_64-linux/usr/armv7a/lib/gcc/arm-angstrom-linux-gnueabi/4.3.3/include -isystem /home/david/overo-new/tmp/sysroots/x86_64-linux/usr/armv7a/lib/gcc/arm-angstrom-linux-gnueabi/4.3.3/include-fixed -isystem /home/david/overo-new/tmp/sysroots/armv7a-angstrom-linux-gnueabi/usr/include -xc - -o /home/david/overo-new/tmp/work/armv7a-angstrom-linux-gnueabi/glibc-2.9-r37.3/build-arm-angstrom-linux-gnueabi/bits/stdio_lim.hT
| /bin/sh: line 3: arm-angstrom-linux-gnueabi-gcc: command not found
| sed '/^[     ]*#/d;s/^[     ]*%/#/' ports/sysdeps/arm/shlib-versions nptl/shlib-versions libidn/shlib-versions nptl_db/shlib-versions shlib-versions \
|     | arm-angstrom-linux-gnueabi-gcc -march=armv7-a -mtune=cortex-a8 -mfpu=neon -mfloat-abi=softfp -mthumb-interwork -mno-thumb -E -undef  -Iinclude  -I/home/david/overo-new/tmp/work/armv7a-angstrom-linux-gnueabi/glibc-2.9-r37.3/build-arm-angstrom-linux-gnueabi -Iports/sysdeps/arm/elf -Iports/sysdeps/unix/sysv/linux/arm/eabi/nptl -Iports/sysdeps/unix/sysv/linux/arm/eabi -Isysdeps/unix/sysv/linux/arm/eabi -Iports/sysdeps/unix/sysv/linux/arm/nptl -Iports/sysdeps/unix/sysv/linux/arm -Isysdeps/unix/sysv/linux/arm -Iports/sysdeps/unix/sysv/linux -Inptl/sysdeps/unix/sysv/linux -Inptl/sysdeps/pthread -Isysdeps/pthread -Isysdeps/unix/sysv/linux -Isysdeps/gnu -Isysdeps/unix/common -Isysdeps/unix/mman -Isysdeps/unix/inet -Iports/sysdeps/unix/sysv -Inptl/sysdeps/unix/sysv -Isysdeps/unix/sysv -Iports/sysdeps/unix/arm -Iports/sysdeps/unix -Inptl/sysdeps/unix -Isysdeps/unix -Isysdeps/posix -Iports/sysdeps/arm/eabi -Iports/sysdeps/arm/fpu -Iports/sysdeps/arm/nptl -Iports/sysdeps/arm -Isysdeps/wordsize-32 -Isysdeps/ieee754/flt-32 -Isysdeps/ieee754/dbl-64 -Isysdeps/ieee754 -Isysdeps/generic/elf -Isysdeps/generic -Iports -Inptl   -Ilibio -I. -nostdinc -isystem /home/david/overo-new/tmp/sysroots/x86_64-linux/usr/armv7a/lib/gcc/arm-angstrom-linux-gnueabi/4.3.3/include -isystem /home/david/overo-new/tmp/sysroots/x86_64-linux/usr/armv7a/lib/gcc/arm-angstrom-linux-gnueabi/4.3.3/include-fixed -isystem /home/david/overo-new/tmp/sysroots/armv7a-angstrom-linux-gnueabi/usr/include -D_LIBC_REENTRANT -include include/libc-symbols.h       -x assembler-with-cpp - \
|            > /home/david/overo-new/tmp/work/armv7a-angstrom-linux-gnueabi/glibc-2.9-r37.3/build-arm-angstrom-linux-gnueabi/shlib-versions.v.iT
| /bin/sh: line 1: arm-angstrom-linux-gnueabi-gcc: command not found
| sed: couldn't flush stdout: Broken pipe
| make  subdir=csu -C csu ..=../ subdir_lib
| make[2]: Entering directory `/home/david/overo-new/tmp/work/armv7a-angstrom-linux-gnueabi/glibc-2.9-r37.3/glibc-2.9/csu'
| { echo '#include "../posix/bits/posix1_lim.h"';        \
|       echo '#define _LIBC 1';                    \
|       echo '#include "../misc/sys/uio.h"'; } |            \
|     arm-angstrom-linux-gnueabi-gcc -march=armv7-a -mtune=cortex-a8 -mfpu=neon -mfloat-abi=softfp -mthumb-interwork -mno-thumb -E -dM -MD -MP -MF /home/david/overo-new/tmp/work/armv7a-angstrom-linux-gnueabi/glibc-2.9-r37.3/build-arm-angstrom-linux-gnueabi/bits/stdio_lim.dT -MT '/home/david/overo-new/tmp/work/armv7a-angstrom-linux-gnueabi/glibc-2.9-r37.3/build-arm-angstrom-linux-gnueabi/bits/stdio_lim.h /home/david/overo-new/tmp/work/armv7a-angstrom-linux-gnueabi/glibc-2.9-r37.3/build-arm-angstrom-linux-gnueabi/bits/stdio_lim.d'     \
|           -I../include -I/home/david/overo-new/tmp/work/armv7a-angstrom-linux-gnueabi/glibc-2.9-r37.3/build-arm-angstrom-linux-gnueabi/csu -I/home/david/overo-new/tmp/work/armv7a-angstrom-linux-gnueabi/glibc-2.9-r37.3/build-arm-angstrom-linux-gnueabi -I../ports/sysdeps/arm/elf -I../ports/sysdeps/unix/sysv/linux/arm/eabi/nptl -I../ports/sysdeps/unix/sysv/linux/arm/eabi -I../sysdeps/unix/sysv/linux/arm/eabi -I../ports/sysdeps/unix/sysv/linux/arm/nptl -I../ports/sysdeps/unix/sysv/linux/arm -I../sysdeps/unix/sysv/linux/arm -I../ports/sysdeps/unix/sysv/linux -I../nptl/sysdeps/unix/sysv/linux -I../nptl/sysdeps/pthread -I../sysdeps/pthread -I../sysdeps/unix/sysv/linux -I../sysdeps/gnu -I../sysdeps/unix/common -I../sysdeps/unix/mman -I../sysdeps/unix/inet -I../ports/sysdeps/unix/sysv -I../nptl/sysdeps/unix/sysv -I../sysdeps/unix/sysv -I../ports/sysdeps/unix/arm -I../ports/sysdeps/unix -I../nptl/sysdeps/unix -I../sysdeps/unix -I../sysdeps/posix -I../ports/sysdeps/arm/eabi -I../ports/sysdeps/arm/fpu -I../ports/sysdeps/arm/nptl -I../ports/sysdeps/arm -I../sysdeps/wordsize-32 -I../sysdeps/ieee754/flt-32 -I../sysdeps/ieee754/dbl-64 -I../sysdeps/ieee754 -I../sysdeps/generic/elf -I../sysdeps/generic -I../ports -I../nptl  -I.. -I../libio -I. -nostdinc -isystem /home/david/overo-new/tmp/sysroots/x86_64-linux/usr/armv7a/lib/gcc/arm-angstrom-linux-gnueabi/4.3.3/include -isystem /home/david/overo-new/tmp/sysroots/x86_64-linux/usr/armv7a/lib/gcc/arm-angstrom-linux-gnueabi/4.3.3/include-fixed -isystem /home/david/overo-new/tmp/sysroots/armv7a-angstrom-linux-gnueabi/usr/include -xc - -o /home/david/overo-new/tmp/work/armv7a-angstrom-linux-gnueabi/glibc-2.9-r37.3/build-arm-angstrom-linux-gnueabi/bits/stdio_lim.hT
| /bin/sh: line 3: arm-angstrom-linux-gnueabi-gcc: command not found
| sed '/^[     ]*#/d;s/^[     ]*%/#/' ../ports/sysdeps/arm/shlib-versions ../nptl/shlib-versions ../libidn/shlib-versions ../nptl_db/shlib-versions ../shlib-versions \
|     | arm-angstrom-linux-gnueabi-gcc -march=armv7-a -mtune=cortex-a8 -mfpu=neon -mfloat-abi=softfp -mthumb-interwork -mno-thumb -E -undef  -I../include -I/home/david/overo-new/tmp/work/armv7a-angstrom-linux-gnueabi/glibc-2.9-r37.3/build-arm-angstrom-linux-gnueabi/csu -I/home/david/overo-new/tmp/work/armv7a-angstrom-linux-gnueabi/glibc-2.9-r37.3/build-arm-angstrom-linux-gnueabi -I../ports/sysdeps/arm/elf -I../ports/sysdeps/unix/sysv/linux/arm/eabi/nptl -I../ports/sysdeps/unix/sysv/linux/arm/eabi -I../sysdeps/unix/sysv/linux/arm/eabi -I../ports/sysdeps/unix/sysv/linux/arm/nptl -I../ports/sysdeps/unix/sysv/linux/arm -I../sysdeps/unix/sysv/linux/arm -I../ports/sysdeps/unix/sysv/linux -I../nptl/sysdeps/unix/sysv/linux -I../nptl/sysdeps/pthread -I../sysdeps/pthread -I../sysdeps/unix/sysv/linux -I../sysdeps/gnu -I../sysdeps/unix/common -I../sysdeps/unix/mman -I../sysdeps/unix/inet -I../ports/sysdeps/unix/sysv -I../nptl/sysdeps/unix/sysv -I../sysdeps/unix/sysv -I../ports/sysdeps/unix/arm -I../ports/sysdeps/unix -I../nptl/sysdeps/unix -I../sysdeps/unix -I../sysdeps/posix -I../ports/sysdeps/arm/eabi -I../ports/sysdeps/arm/fpu -I../ports/sysdeps/arm/nptl -I../ports/sysdeps/arm -I../sysdeps/wordsize-32 -I../sysdeps/ieee754/flt-32 -I../sysdeps/ieee754/dbl-64 -I../sysdeps/ieee754 -I../sysdeps/generic/elf -I../sysdeps/generic -I../ports -I../nptl  -I.. -I../libio -I. -nostdinc -isystem /home/david/overo-new/tmp/sysroots/x86_64-linux/usr/armv7a/lib/gcc/arm-angstrom-linux-gnueabi/4.3.3/include -isystem /home/david/overo-new/tmp/sysroots/x86_64-linux/usr/armv7a/lib/gcc/arm-angstrom-linux-gnueabi/4.3.3/include-fixed -isystem /home/david/overo-new/tmp/sysroots/armv7a-angstrom-linux-gnueabi/usr/include -D_LIBC_REENTRANT -include ../include/libc-symbols.h       -DHAVE_INITFINI -x assembler-with-cpp - \
|            > /home/david/overo-new/tmp/work/armv7a-angstrom-linux-gnueabi/glibc-2.9-r37.3/build-arm-angstrom-linux-gnueabi/shlib-versions.v.iT
| /bin/sh: line 1: arm-angstrom-linux-gnueabi-gcc: command not found
| sed: couldn't flush stdout: Broken pipe
| make[2]: Leaving directory `/home/david/overo-new/tmp/work/armv7a-angstrom-linux-gnueabi/glibc-2.9-r37.3/glibc-2.9/csu'
| make[1]: *** [csu/subdir_lib] Error 2
| make[1]: Leaving directory `/home/david/overo-new/tmp/work/armv7a-angstrom-linux-gnueabi/glibc-2.9-r37.3/glibc-2.9'
| make: *** [all] Error 2
| FATAL: oe_runmake failed
NOTE: Task failed: /home/david/overo-new/tmp/work/armv7a-angstrom-linux-gnueabi/glibc-2.9-r37.3/temp/log.do_compile.3483
ERROR: TaskFailed event exception, aborting
ERROR: Build of /home/david/overo-new/org.openembedded.dev/recipes/glibc/glibc_2.9.bb do_compile failed
ERROR: Task 144 (/home/david/overo-new/org.openembedded.dev/recipes/glibc/glibc_2.9.bb, do_compile) failed
NOTE: Tasks Summary: Attempted 299 tasks of which 299 didn't need to be rerun and 1 failed.
ERROR: '/home/david/overo-new/org.openembedded.dev/recipes/glibc/glibc_2.9.bb' failed


Dave

On Sat, Mar 13, 2010 at 9:45 AM, Victhor <victhor.foster@gmail.com> wrote:
I'm not trying to build glibc, bitbake wants it to build supertux for
some reason.
This is the error I get if I try building the normal glibc recipe(2.9):
victhor@victhor-laptop:~/overo-oe$ bitbake -f -k glibc
WARNING: No matches in filesystem
for /home/victhor/overo-oe/user.collection in COLLECTIONS
NOTE: Psyco JIT Compiler (http://psyco.sf.net) not available. Install it
to increase performance.
NOTE: Handling BitBake files: / (8069/8069) [100 %]
NOTE: Parsing finished. 7435 cached, 317 parsed, 317 skipped, 2 masked.
NOTE: Resolving any missing task queue dependencies
NOTE: Preparing runqueue
NOTE: Executing runqueue
NOTE: Running task 329 of 487 (ID:
7, /home/victhor/overo-oe/org.openembedded.dev/recipes/glibc/glibc_2.9.bb, do_compile)
NOTE: Running task 478 of 487 (ID:
13, /home/victhor/overo-oe/org.openembedded.dev/recipes/glibc/glibc_2.9.bb, do_distribute_sources)
ERROR: function do_compile failed
ERROR: log data follows
(/home/victhor/overo-oe/tmp/work/armv7a-angstrom-linux-gnueabi/glibc-2.9-r35.3/temp/log.do_compile.23969)
| NOTE: nothing to compile
| /home/victhor/overo-oe/tmp/work/armv7a-angstrom-linux-gnueabi/glibc-2.9-r35.3/temp/run.do_compile.23969: line 1072: cd: /home/victhor/overo-oe/tmp/work/armv7a-angstrom-linux-gnueabi/glibc-2.9-r35.3/glibc-2.9/sunrpc/rpcsvc: No such file or directory
NOTE: Task
failed: /home/victhor/overo-oe/tmp/work/armv7a-angstrom-linux-gnueabi/glibc-2.9-r35.3/temp/log.do_compile.23969
ERROR: TaskFailed event exception, aborting
ERROR: Build
of /home/victhor/overo-oe/org.openembedded.dev/recipes/glibc/glibc_2.9.bb do_compile failed
ERROR: Task 7
(/home/victhor/overo-oe/org.openembedded.dev/recipes/glibc/glibc_2.9.bb,
do_compile) failed
NOTE: Tasks Summary: Attempted 477 tasks of which 476 didn't need to be
rerun and 1 failed.
ERROR:
'/home/victhor/overo-oe/org.openembedded.dev/recipes/glibc/glibc_2.9.bb'
failed
victhor@victhor-laptop:~/overo-oe$

> On 03/12/2010 08:56 PM, Victhor wrote:
> > I get this when bitbake tries to compile glibc:
> > victhor@victhor-laptop:~/overo-oe/org.openembedded.dev/recipes/glibc/glibc-cvs-2.3.5$ bitbake glibc -f -b glibc_cvs.bb
>
> I think that is not the correct glibc recipe to build. Why are you
> trying to build glibc directly?
>
> Philip
>
>
> > WARNING: No matches in filesystem
> > for /home/victhor/overo-oe/user.collection in COLLECTIONS
> > NOTE: Out of date cache found, rebuilding...
> > NOTE: Out of date cache found, rebuilding...
> > NOTE: preferred version 2.9 of glibc not available (for item glibc)
> > NOTE: Preparing runqueue
> > NOTE: Executing runqueue
> > NOTE: Running task 5 of 18 (ID:
> > 4, /home/victhor/overo-oe/org.openembedded.dev/recipes/glibc/glibc_cvs.bb, do_patch)
> > NOTE: Applying patch 'nscd-init.patch' (../files/nscd-init.patch)
> > NOTE: Applying patch 'arm-audit.patch' (arm-audit.patch)
> > ERROR: Error in
> > executing: /home/victhor/overo-oe/org.openembedded.dev/recipes/glibc/glibc_cvs.bb
> > ERROR: Exception:<class 'CmdError'>  Message:Command Error: exit status:
> > 1  Output:
> > Applying patch arm-audit.patch
> > patching file sysdeps/generic/ldsodefs.h
> > Hunk #1 succeeded at 206 (offset 3 lines).
> > Hunk #2 FAILED at 289.
> > Hunk #3 FAILED at 361.
> > 2 out of 3 hunks FAILED -- rejects in file sysdeps/generic/ldsodefs.h
> > patching file elf/tst-auditmod1.c
> > Hunk #1 FAILED at 192.
> > 1 out of 1 hunk FAILED -- rejects in file elf/tst-auditmod1.c
> > Patch arm-audit.patch does not apply (enforce with -f)
> > ERROR: Printing the environment of the function
> > ERROR: Error in
> > executing: /home/victhor/overo-oe/org.openembedded.dev/recipes/glibc/glibc_cvs.bb
> > ERROR: Exception:<class 'CmdError'>  Message:Command Error: exit status:
> > 1  Output:
> > Applying patch arm-audit.patch
> > patching file sysdeps/generic/ldsodefs.h
> > Hunk #1 succeeded at 206 (offset 3 lines).
> > Hunk #2 FAILED at 289.
> > Hunk #3 FAILED at 361.
> > 2 out of 3 hunks FAILED -- rejects in file sysdeps/generic/ldsodefs.h
> > patching file elf/tst-auditmod1.c
> > Hunk #1 FAILED at 192.
> > 1 out of 1 hunk FAILED -- rejects in file elf/tst-auditmod1.c
> > Patch arm-audit.patch does not apply (enforce with -f)
> > ERROR: Printing the environment of the function
> > ERROR: Error in
> > executing: /home/victhor/overo-oe/org.openembedded.dev/recipes/glibc/glibc_cvs.bb
> > ERROR: Exception:<class 'CmdError'>  Message:Command Error: exit status:
> > 1  Output:
> > Applying patch arm-audit.patch
> > patching file sysdeps/generic/ldsodefs.h
> > Hunk #1 succeeded at 206 (offset 3 lines).
> > Hunk #2 FAILED at 289.
> > Hunk #3 FAILED at 361.
> > 2 out of 3 hunks FAILED -- rejects in file sysdeps/generic/ldsodefs.h
> > patching file elf/tst-auditmod1.c
> > Hunk #1 FAILED at 192.
> > 1 out of 1 hunk FAILED -- rejects in file elf/tst-auditmod1.c
> > Patch arm-audit.patch does not apply (enforce with -f)
> > ERROR: Printing the environment of the function
> > ERROR: Build
> > of /home/victhor/overo-oe/org.openembedded.dev/recipes/glibc/glibc_cvs.bb do_patch failed
> > Traceback (most recent call last):
> >    File "/home/victhor/overo-oe/bitbake/bin/bitbake", line 143, in
> > <module>
> >      main()
> >    File "/home/victhor/overo-oe/bitbake/bin/bitbake", line 140, in main
> >      cooker.cook()
> >    File "/home/victhor/overo-oe/bitbake/lib/bb/cooker.py", line 608, in
> > cook
> >      if not self.buildFile(self.configuration.buildfile):
> >    File "/home/victhor/overo-oe/bitbake/lib/bb/cooker.py", line 510, in
> > buildFile
> >      failures = rq.execute_runqueue()
> >    File "/home/victhor/overo-oe/bitbake/lib/bb/runqueue.py", line 841, in
> > execute_runqueue
> >      self.execute_runqueue_internal()
> >    File "/home/victhor/overo-oe/bitbake/lib/bb/runqueue.py", line 950, in
> > execute_runqueue_internal
> >      self.cooker.tryBuild(fn)
> >    File "/home/victhor/overo-oe/bitbake/lib/bb/cooker.py", line 136, in
> > tryBuild
> >      return self.tryBuildPackage(fn, item, self.configuration.cmd,
> > the_data)
> >    File "/home/victhor/overo-oe/bitbake/lib/bb/cooker.py", line 110, in
> > tryBuildPackage
> >      bb.build.exec_task('do_%s' % task, the_data)
> >    File "/home/victhor/overo-oe/bitbake/lib/bb/build.py", line 283, in
> > exec_task
> >      exec_func(task, localdata)
> >    File "/home/victhor/overo-oe/bitbake/lib/bb/build.py", line 120, in
> > exec_func
> >      exec_func_python(func, d)
> >    File "/home/victhor/overo-oe/bitbake/lib/bb/build.py", line 141, in
> > exec_func_python
> >      utils.better_exec(comp, g, tmp, bbfile)
> >    File "/home/victhor/overo-oe/bitbake/lib/bb/utils.py", line 185, in
> > better_exec
> >      exec code in context
> >    File "do_patch", line 4, in<module>
> >    File "do_patch", line 2, in do_patch
> >    File "/home/victhor/overo-oe/bitbake/lib/bb/build.py", line 120, in
> > exec_func
> >      exec_func_python(func, d)
> >    File "/home/victhor/overo-oe/bitbake/lib/bb/build.py", line 141, in
> > exec_func_python
> >      utils.better_exec(comp, g, tmp, bbfile)
> >    File "/home/victhor/overo-oe/bitbake/lib/bb/utils.py", line 185, in
> > better_exec
> >      exec code in context
> >    File "base_do_patch", line 4, in<module>
> >    File "base_do_patch", line 2, in base_do_patch
> >    File "/home/victhor/overo-oe/bitbake/lib/bb/build.py", line 120, in
> > exec_func
> >      exec_func_python(func, d)
> >    File "/home/victhor/overo-oe/bitbake/lib/bb/build.py", line 141, in
> > exec_func_python
> >      utils.better_exec(comp, g, tmp, bbfile)
> >    File "/home/victhor/overo-oe/bitbake/lib/bb/utils.py", line 185, in
> > better_exec
> >      exec code in context
> >    File "patch_do_patch", line 98, in<module>
> >    File "patch_do_patch", line 96, in patch_do_patch
> >    File "<bb>", line 361, in Resolve
> > __builtin__.CmdError: Command Error: exit status: 1  Output:
> > Applying patch arm-audit.patch
> > patching file sysdeps/generic/ldsodefs.h
> > Hunk #1 succeeded at 206 (offset 3 lines).
> > Hunk #2 FAILED at 289.
> > Hunk #3 FAILED at 361.
> > 2 out of 3 hunks FAILED -- rejects in file sysdeps/generic/ldsodefs.h
> > patching file elf/tst-auditmod1.c
> > Hunk #1 FAILED at 192.
> > 1 out of 1 hunk FAILED -- rejects in file elf/tst-auditmod1.c
> > Patch arm-audit.patch does not apply (enforce with -f)
> > ERROR: Task 4
> > (/home/victhor/overo-oe/org.openembedded.dev/recipes/glibc/glibc_cvs.bb,
> > do_patch) failed
> > NOTE: Tasks Summary: Attempted 5 tasks of which 5 didn't need to be
> > rerun and 1 failed.
> > ERROR:
> > '/home/victhor/overo-oe/org.openembedded.dev/recipes/glibc/glibc_cvs.bb'
> > failed
> > victhor@victhor-laptop:~/overo-oe/org.openembedded.dev/recipes/glibc/glibc-cvs-2.3.5$
> > Help?
> >
> >
> > ------------------------------------------------------------------------------
> > Download Intel&#174; Parallel Studio Eval
> > Try the new software tools for yourself. Speed compiling, find bugs
> > proactively, and fine-tune applications for parallel performance.
> > See why Intel Parallel Studio got high marks during beta.
> > http://p.sf.net/sfu/intel-sw-dev
> > _______________________________________________
> > gumstix-users mailing list
> > gumstix-users@lists.sourceforge.net
> > https://lists.sourceforge.net/lists/listinfo/gumstix-users
> >
>
> ------------------------------------------------------------------------------
> Download Intel&#174; Parallel Studio Eval
> Try the new software tools for yourself. Speed compiling, find bugs
> proactively, and fine-tune applications for parallel performance.
> See why Intel Parallel Studio got high marks during beta.
> http://p.sf.net/sfu/intel-sw-dev
> _______________________________________________
> gumstix-users mailing list
> gumstix-users@lists.sourceforge.net
> https://lists.sourceforge.net/lists/listinfo/gumstix-users



------------------------------------------------------------------------------
Download Intel&#174; Parallel Studio Eval
Try the new software tools for yourself. Speed compiling, find bugs
proactively, and fine-tune applications for parallel performance.
See why Intel Parallel Studio got high marks during beta.
http://p.sf.net/sfu/intel-sw-dev
_______________________________________________
gumstix-users mailing list
gumstix-users@lists.sourceforge.net
https://lists.sourceforge.net/lists/listinfo/gumstix-users