Hi Michael,

This was covered already in other postings (from myself and Ash) yesterday.

It is an issue from upstream OE.  They are working on a fix, but won't be migrated
to gumstix-oe Git branches until later.

Current workaround is:

$ sudo apt-get install libgtk2.0-dev

  on the build machine

then
$ bitbake -c clean gtk+

then proceed with your
$ bitbake-console-image

 again.

From: Michael Hartung <M.Hartung@HS-DataForce.com>
To: gumstix-users@lists.sourceforge.net
Sent: Wed, March 10, 2010 4:15:32 AM
Subject: [Gumstix-users] Gumstix overo - Setting up a build environment - “gtk+_2.18.6.bb” failed

Hi,

starting to work with a gumstix overo Air I tried to set up an build
environment (final statement: "bitbake omap3-console-image") getting the
following result after approx. 4 hours:

---
| make[2]: Leaving directory
`~/overo-oe/tmp/work/armv7a-angstrom-linux-gnueabi/gtk+-2.18.6-r8.3/gtk+-2.18.6/modules'

| Making all in demos
| make[2]: Entering directory
`~/overo-oe/tmp/work/armv7a-angstrom-linux-gnueabi/gtk+-2.18.6-r8.3/gtk+-2.18.6/demos'

| no --raw --build-list        \
|             apple_red  ./apple-red.png    \
|                gnome_foot ./gnome-foot.png    \
|        > test-inline-pixbufs.h                \
|     || (rm -f test-inline-pixbufs.h && false)
| /bin/sh: no: command not found
| make[2]: *** [test-inline-pixbufs.h] Error 1
| make[2]: Leaving directory
`~/overo-oe/tmp/work/armv7a-angstrom-linux-gnueabi/gtk+-2.18.6-r8.3/gtk+-2.18.6/demos'

| make[1]: *** [all-recursive] Error 1
| make[1]: Leaving directory
`~/overo-oe/tmp/work/armv7a-angstrom-linux-gnueabi/gtk+-2.18.6-r8.3/gtk+-2.18.6'

| make: *** [all] Error 2
| FATAL: oe_runmake failed
NOTE: Task failed:
~/overo-oe/tmp/work/armv7a-angstrom-linux-gnueabi/gtk+-2.18.6-r8.3/temp/log.do_compile.31139

ERROR: TaskFailed event exception, aborting
ERROR: Build of
~/overo-oe/org.openembedded.dev/recipes/gtk+/gtk+_2.18.6.bb do_compile
failed
ERROR: Task 2544
(~/overo-oe/org.openembedded.dev/recipes/gtk+/gtk+_2.18.6.bb,
do_compile) failed
NOTE: Tasks Summary: Attempted 1180 tasks of which 0 didn't need to be
rerun and 1 failed.
ERROR: '~/overo-oe/org.openembedded.dev/recipes/gtk+/gtk+_2.18.6.bb' failed
---

Of course...  any help would be appreciated.

Michael


--
Best regards,
Michael Hartung

HS-DATAFORCE
E-mail:    M.Hartung@HS-DataForce.com

------------------------------------------------------------------------------
Download Intel® Parallel Studio Eval
Try the new software tools for yourself. Speed compiling, find bugs
proactively, and fine-tune applications for parallel performance.
See why Intel Parallel Studio got high marks during beta.
http://p.sf.net/sfu/intel-sw-dev
_______________________________________________
gumstix-users mailing list
gumstix-users@lists.sourceforge.net
https://lists.sourceforge.net/lists/listinfo/gumstix-users