1539 doesn’t compile – a patch fails….is it just me??  Looks like the patch has already been applied.

 

Applying patch /usr6/experiment/mike/gumstixkraken/gumstix-buildroot/toolchain/uClibc/restore-baudrates.patch

patching file libc/sysdeps/linux/common/bits/termios.h

Hunk #1 FAILED at 156.

Hunk #2 FAILED at 170.

2 out of 2 hunks FAILED -- rejects in file libc/sysdeps/linux/common/bits/termios.h

Patch /usr6/experiment/mike/gumstixkraken/gumstix-buildroot/toolchain/uClibc/restore-baudrates.patch does not apply (enforce with -f

)

make: *** [/usr6/experiment/mike/gumstixkraken/gumstix-buildroot/toolchain_build_arm_nofpu/uClibc-0.9.28/.patched] Error 1

 

___________________

Michael D. Black

black@essexcorp.com

 

 
 
 
 
 
 
 
This electronic message and any files transmitted with it contain information which may be privileged and/or proprietary. The information is intended for use solely by the intended recipient(s). If you are not the intended recipient, be aware that any disclosure, copying, distribution or use of this information is prohibited. If you have received this electronic message in error, please advise the sender by reply email or by telephone (301-939-7000) and delete the message.