Hi All:

I recently bought a Overo Fire on Chestnut43. I also built a basic console image after facing problems which I resolved using answers in this forum. Now, I have come to the following as the plan for future development.
1. Create a buildroot image
2. Flash it to the device
3. Cross compile the usr program i.e. my  programs
4. Transfer the exe to GumStix board and run the program.

Q1. Is this the right way of doing things?
Q2. I was trying to build the buildroot image but it was failing for a lot of files which it was looking for in the dl/ directory. I found all those and ran the build again. I got the following error and could not resolve this.

make[1]: Entering directory `/home/bhuser/gumstix-
  CHK     include/linux/version.h
  CHK     include/linux/utsrelease.h
  Generating include/asm-arm/mach-types.h
  HOSTCC  scripts/kallsyms
  CC      arch/arm/kernel/asm-offsets.s
scripts/kallsyms.c: In function ‘read_symbol’:
scripts/kallsyms.c:83: warning: ignoring return value of ‘fgets’, declared with attribute warn_unused_result
  CC      scripts/mod/empty.o
  HOSTCC  scripts/mod/mk_elfconfig
  HOSTCC  scripts/pnmtologo
  MKELF   scripts/mod/elfconfig.h
  HOSTCC  scripts/mod/file2alias.o
  HOSTCC  scripts/mod/modpost.o
  HOSTCC  scripts/mod/sumversion.o
scripts/mod/sumversion.c: In function ‘get_src_version’:
scripts/mod/sumversion.c:384: error: ‘PATH_MAX’ undeclared (first use in this function)
scripts/mod/sumversion.c:384: error: (Each undeclared identifier is reported only once
scripts/mod/sumversion.c:384: error: for each function it appears in.)
scripts/mod/sumversion.c:384: warning: unused variable ‘filelist’
make[3]: *** [scripts/mod/sumversion.o] Error 1
make[2]: *** [scripts/mod] Error 2
make[1]: *** [scripts] Error 2
make[1]: *** Waiting for unfinished jobs....
  GEN     include/asm-arm/asm-offsets.h
make[1]: Leaving directory `/home/bhuser/gumstix-buildroot/build_arm_nofpu/linux-2.6.21gum'
make: *** [/home/bhuser/gumstix-buildroot/build_arm_nofpu/linux-2.6.21gum/arch/arm/boot/compressed/vmlinux] Error 2

Can someone help me in knowing where I am going wrong? Any help is appreciated.

Have a great day!

Shashikiran Srinivasa