#31 wouldn't install

open
nobody
5
2015-02-13
2003-04-23
Anonymous
No

./setup.pl
Loading external module Archive::Tar...found.
Loading external module LWP::Simple...found.
Loading external module XML::Parser...found.
Loading external module XML::DOM...not found.
Loading external module File::Path...found.
Loading external module File::Spec::Functions...found.
Loading external module URI...found.
Loading external module URI::file...found.
Loading external module PPM...not found.
Loading external module CPAN...found.
Some dependencies were not found. Would you like to
install them now?(y/n):y
OK
Attempting to install XML::DOM...
The following installation mechanisms are available:
1) PPM
2) CPAN
Please enter your choice (1-2): 2
Installing cpan package XML::DOM...
CPAN: Storable loaded ok
Going to read /root/.cpan/Metadata
Database was generated on Tue, 22 Apr 2003 21:41:40 GMT
Running install for module XML::DOM
Running make for T/TJ/TJMATHER/XML-DOM-1.42.tar.gz
CPAN: Digest::MD5 loaded ok
Checksum for
/root/.cpan/sources/authors/id/T/TJ/TJMATHER/XML-DOM-1.42.tar.gz
ok
Scanning cache /root/.cpan/build for sizes
XML-DOM-1.42/
XML-DOM-1.42/lib/
XML-DOM-1.42/lib/XML/
XML-DOM-1.42/lib/XML/DOM/
XML-DOM-1.42/lib/XML/DOM/DocumentType.pod
XML-DOM-1.42/lib/XML/DOM/DocumentFragment.pod
XML-DOM-1.42/lib/XML/DOM/AttlistDecl.pod
XML-DOM-1.42/lib/XML/DOM/Notation.pod
XML-DOM-1.42/lib/XML/DOM/Attr.pod
XML-DOM-1.42/lib/XML/DOM/ProcessingInstruction.pod
XML-DOM-1.42/lib/XML/DOM/Entity.pod
XML-DOM-1.42/lib/XML/DOM/Document.pod
XML-DOM-1.42/lib/XML/DOM/Parser.pod
XML-DOM-1.42/lib/XML/DOM/NodeList.pm
XML-DOM-1.42/lib/XML/DOM/Node.pod
XML-DOM-1.42/lib/XML/DOM/ElementDecl.pod
XML-DOM-1.42/lib/XML/DOM/EntityReference.pod
XML-DOM-1.42/lib/XML/DOM/NodeList.pod
XML-DOM-1.42/lib/XML/DOM/CharacterData.pod
XML-DOM-1.42/lib/XML/DOM/DOMException.pm
XML-DOM-1.42/lib/XML/DOM/PerlSAX.pm
XML-DOM-1.42/lib/XML/DOM/NamedNodeMap.pm
XML-DOM-1.42/lib/XML/DOM/NamedNodeMap.pod
XML-DOM-1.42/lib/XML/DOM/Comment.pod
XML-DOM-1.42/lib/XML/DOM/Element.pod
XML-DOM-1.42/lib/XML/DOM/XMLDecl.pod
XML-DOM-1.42/lib/XML/DOM/CDATASection.pod
XML-DOM-1.42/lib/XML/DOM/DOMImplementation.pod
XML-DOM-1.42/lib/XML/DOM/Text.pod
XML-DOM-1.42/lib/XML/DOM/AttDef.pod
XML-DOM-1.42/lib/XML/DOM.pm
XML-DOM-1.42/lib/XML/Handler/
XML-DOM-1.42/lib/XML/Handler/BuildDOM.pm
XML-DOM-1.42/t/
XML-DOM-1.42/t/dom_jp_minus.t
XML-DOM-1.42/t/dom_noexpand.t
XML-DOM-1.42/t/dom_template.t
XML-DOM-1.42/t/dom_jp_cdata.t
XML-DOM-1.42/t/dom_jp_modify.t
XML-DOM-1.42/t/dom_text.t
XML-DOM-1.42/t/dom_cdata.t
XML-DOM-1.42/t/dom_jp_attr.t
XML-DOM-1.42/t/dom_extent.t
XML-DOM-1.42/t/dom_minus.t
XML-DOM-1.42/t/dom_attr.t
XML-DOM-1.42/t/dom_encode.t
XML-DOM-1.42/t/dom_jp_example.t
XML-DOM-1.42/t/dom_extent.ent
XML-DOM-1.42/t/dom_jp_print.t
XML-DOM-1.42/t/dom_documenttype.t
XML-DOM-1.42/t/dom_extent.dtd
XML-DOM-1.42/t/dom_jp_astress.t
XML-DOM-1.42/t/build_dom.t
XML-DOM-1.42/t/dom_print.t
XML-DOM-1.42/t/dom_astress.t
XML-DOM-1.42/t/dom_modify.t
XML-DOM-1.42/t/dom_example.t
XML-DOM-1.42/FAQ.xml
XML-DOM-1.42/Changes
XML-DOM-1.42/MANIFEST
XML-DOM-1.42/CmpDOM.pm
XML-DOM-1.42/samples/
XML-DOM-1.42/samples/minutes.xml
XML-DOM-1.42/samples/REC-xml-19980210.xml
XML-DOM-1.42/BUGS
XML-DOM-1.42/CheckAncestors.pm
XML-DOM-1.42/XML-Parser-2.31.patch
XML-DOM-1.42/Makefile.PL
XML-DOM-1.42/README
Removing previously used /root/.cpan/build/XML-DOM-1.42

CPAN.pm: Going to build T/TJ/TJMATHER/XML-DOM-1.42.tar.gz

Checking if your kit is complete...
Looks good
Warning: prerequisite XML::Parser::PerlSAX 0.07 not found.
Writing Makefile for XML-DOM
---- Unsatisfied dependencies detected during
[T/TJ/TJMATHER/XML-DOM-1.42.tar.gz] -----
XML::Parser::PerlSAX
Shall I follow them and prepend them to the queue
of modules we are processing right now? [yes]
Running make test
Delayed until after prerequisites
Running make install
Delayed until after prerequisites
Running install for module XML::Parser::PerlSAX
Running make for K/KM/KMACLEOD/libxml-perl-0.07.tar.gz
Checksum for
/root/.cpan/sources/authors/id/K/KM/KMACLEOD/libxml-perl-0.07.tar.gz
ok
libxml-perl-0.07
libxml-perl-0.07/t
libxml-perl-0.07/t/canon_xml_writer.t
libxml-perl-0.07/t/stream.t
libxml-perl-0.07/t/xp_sax.t
libxml-perl-0.07/t/subs.t
libxml-perl-0.07/t/amsterdam.t
libxml-perl-0.07/t/schema.t
libxml-perl-0.07/lib
libxml-perl-0.07/lib/XML
libxml-perl-0.07/lib/XML/Handler
libxml-perl-0.07/lib/XML/Handler/Sample.pm
libxml-perl-0.07/lib/XML/Handler/XMLWriter.pm
libxml-perl-0.07/lib/XML/Handler/CanonXMLWriter.pm
libxml-perl-0.07/lib/XML/Handler/Subs.pm
libxml-perl-0.07/lib/XML/SAX2Perl.pm
libxml-perl-0.07/lib/XML/Perl2SAX.pm
libxml-perl-0.07/lib/XML/PatAct
libxml-perl-0.07/lib/XML/PatAct/MatchName.pmlibxml-perl-0.07/lib/XML/PatAct/Amsterdam.pm
libxml-perl-0.07/lib/XML/PatAct/PatternTempl.pm
libxml-perl-0.07/lib/XML/PatAct/ToObjects.pm
libxml-perl-0.07/lib/XML/PatAct/ActionTempl.pm
libxml-perl-0.07/lib/XML/Parser
libxml-perl-0.07/lib/XML/Parser/PerlSAX.pm
libxml-perl-0.07/lib/XML/ESISParser.pm
libxml-perl-0.07/lib/Data
libxml-perl-0.07/lib/Data/Grove
libxml-perl-0.07/lib/Data/Grove/Parent.pm
libxml-perl-0.07/lib/Data/Grove/Visitor.pm
libxml-perl-0.07/lib/Data/Grove.pm
libxml-perl-0.07/doc
libxml-perl-0.07/doc/index.html
libxml-perl-0.07/doc/mirror.sh
libxml-perl-0.07/doc/modules.xml
libxml-perl-0.07/doc/interface-style.pod
libxml-perl-0.07/doc/UsingPatActModules.pod
libxml-perl-0.07/doc/PerlSAX.pod
libxml-perl-0.07/doc/CreatingPatActModules.pod
libxml-perl-0.07/doc/UsingPerlSAX.pod
libxml-perl-0.07/examples
libxml-perl-0.07/examples/perlsax-test.pl
libxml-perl-0.07/examples/myhandler.xml
libxml-perl-0.07/examples/schema.xml
libxml-perl-0.07/examples/schema.pl
libxml-perl-0.07/examples/esis-test.pl
libxml-perl-0.07/examples/myhandler.pl
libxml-perl-0.07/examples/MyHandler.pm
libxml-perl-0.07/libxml-perl-0.07.spec
libxml-perl-0.07/MANIFEST
libxml-perl-0.07/Changes
libxml-perl-0.07/libxml-perl.spec
libxml-perl-0.07/Makefile.PL
libxml-perl-0.07/ChangeLog
libxml-perl-0.07/README
Removing previously used /root/.cpan/build/libxml-perl-0.07

CPAN.pm: Going to build
K/KM/KMACLEOD/libxml-perl-0.07.tar.gz

Checking if your kit is complete...
Looks good
Writing Makefile for libxml-perl
cp lib/XML/Handler/Subs.pm blib/lib/XML/Handler/Subs.pm
cp lib/XML/Perl2SAX.pm blib/lib/XML/Perl2SAX.pm
cp lib/XML/PatAct/MatchName.pm
blib/lib/XML/PatAct/MatchName.pm
cp lib/XML/SAX2Perl.pm blib/lib/XML/SAX2Perl.pm
cp lib/XML/Handler/Sample.pm blib/lib/XML/Handler/Sample.pm
cp lib/XML/PatAct/ActionTempl.pm
blib/lib/XML/PatAct/ActionTempl.pm
cp lib/Data/Grove/Parent.pm blib/lib/Data/Grove/Parent.pm
cp lib/Data/Grove/Visitor.pm blib/lib/Data/Grove/Visitor.pm
cp lib/XML/Handler/CanonXMLWriter.pm
blib/lib/XML/Handler/CanonXMLWriter.pm
cp lib/XML/PatAct/ToObjects.pm
blib/lib/XML/PatAct/ToObjects.pm
cp lib/XML/ESISParser.pm blib/lib/XML/ESISParser.pm
cp lib/Data/Grove.pm blib/lib/Data/Grove.pm
cp lib/XML/Parser/PerlSAX.pm blib/lib/XML/Parser/PerlSAX.pm
cp lib/XML/PatAct/PatternTempl.pm
blib/lib/XML/PatAct/PatternTempl.pm
cp lib/XML/Handler/XMLWriter.pm
blib/lib/XML/Handler/XMLWriter.pm
cp lib/XML/PatAct/Amsterdam.pm
blib/lib/XML/PatAct/Amsterdam.pm
Manifying blib/man3/XML::Perl2SAX.3
Manifying blib/man3/XML::Handler::Subs.3
Manifying blib/man3/XML::PatAct::MatchName.3
Manifying blib/man3/XML::SAX2Perl.3
Manifying blib/man3/XML::PatAct::ActionTempl.3
Manifying blib/man3/XML::Handler::Sample.3
Manifying blib/man3/Data::Grove::Parent.3
Manifying blib/man3/XML::PatAct::ToObjects.3
Manifying blib/man3/XML::Handler::CanonXMLWriter.3
Manifying blib/man3/Data::Grove::Visitor.3
Manifying blib/man3/XML::ESISParser.3
Manifying blib/man3/XML::Parser::PerlSAX.3
Manifying blib/man3/Data::Grove.3
Manifying blib/man3/XML::PatAct::PatternTempl.3
Manifying blib/man3/XML::PatAct::Amsterdam.3
Manifying blib/man3/XML::Handler::XMLWriter.3
/usr/bin/make -- OK
Running make testPERL_DL_NONLAZY=1 /usr/bin/perl
"-MExtUtils::Command::MM" "-e" "test_harness(0,
'blib/lib', 'blib/arch')" t/*.t
t/amsterdam...........ok

t/canon_xml_writer....ok

t/schema..............ok

t/stream..............FAILED test 11

Failed 1/11 tests, 90.91% okay
t/subs................ok

t/xp_sax..............ok

Failed Test Stat Wstat Total Fail Failed List of Failed
-------------------------------------------------------------------------------
t/stream.t 11 1 9.09% 11
Failed 1/6 test scripts, 83.33% okay. 1/45 subtests
failed, 97.78% okay.
make: *** [test_dynamic] Error 29
/usr/bin/make test -- NOT OK
Running make install
make test had returned bad status, won't install
without force
Running make for T/TJ/TJMATHER/XML-DOM-1.42.tar.gz
Is already unwrapped into directory
/root/.cpan/build/XML-DOM-1.42

CPAN.pm: Going to build T/TJ/TJMATHER/XML-DOM-1.42.tar.gz

cp lib/XML/DOM/DocumentType.pod
blib/lib/XML/DOM/DocumentType.pod
cp lib/XML/DOM.pm blib/lib/XML/DOM.pm
cp lib/XML/Handler/BuildDOM.pm
blib/lib/XML/Handler/BuildDOM.pm
cp lib/XML/DOM/DOMException.pm
blib/lib/XML/DOM/DOMException.pm
cp lib/XML/DOM/DocumentFragment.pod
blib/lib/XML/DOM/DocumentFragment.pod
cp lib/XML/DOM/AttlistDecl.pod
blib/lib/XML/DOM/AttlistDecl.pod
cp lib/XML/DOM/PerlSAX.pm blib/lib/XML/DOM/PerlSAX.pm
cp lib/XML/DOM/Notation.pod blib/lib/XML/DOM/Notation.pod
cp lib/XML/DOM/Attr.pod blib/lib/XML/DOM/Attr.pod
cp lib/XML/DOM/Entity.pod blib/lib/XML/DOM/Entity.pod
cp lib/XML/DOM/NamedNodeMap.pm
blib/lib/XML/DOM/NamedNodeMap.pm
cp lib/XML/DOM/ProcessingInstruction.pod
blib/lib/XML/DOM/ProcessingInstruction.pod
cp lib/XML/DOM/NamedNodeMap.pod
blib/lib/XML/DOM/NamedNodeMap.pod
cp lib/XML/DOM/Document.pod blib/lib/XML/DOM/Document.pod
cp lib/XML/DOM/Parser.pod blib/lib/XML/DOM/Parser.pod
cp lib/XML/DOM/Comment.pod blib/lib/XML/DOM/Comment.pod
cp lib/XML/DOM/Element.pod blib/lib/XML/DOM/Element.pod
cp lib/XML/DOM/NodeList.pm blib/lib/XML/DOM/NodeList.pm
cp lib/XML/DOM/XMLDecl.pod blib/lib/XML/DOM/XMLDecl.pod
cp lib/XML/DOM/CDATASection.pod
blib/lib/XML/DOM/CDATASection.pod
cp lib/XML/DOM/Node.pod blib/lib/XML/DOM/Node.pod
cp lib/XML/DOM/DOMImplementation.pod
blib/lib/XML/DOM/DOMImplementation.pod
cp lib/XML/DOM/EntityReference.pod
blib/lib/XML/DOM/EntityReference.pod
cp lib/XML/DOM/ElementDecl.pod
blib/lib/XML/DOM/ElementDecl.pod
cp lib/XML/DOM/Text.pod blib/lib/XML/DOM/Text.pod
cp lib/XML/DOM/NodeList.pod blib/lib/XML/DOM/NodeList.pod
cp lib/XML/DOM/CharacterData.pod
blib/lib/XML/DOM/CharacterData.pod
cp lib/XML/DOM/AttDef.pod blib/lib/XML/DOM/AttDef.pod
Manifying blib/man3/XML::DOM::Comment.3
Manifying blib/man3/XML::DOM.3
Manifying blib/man3/XML::DOM::DocumentType.3
Manifying blib/man3/XML::DOM::Element.3
Manifying blib/man3/XML::DOM::XMLDecl.3
Manifying blib/man3/XML::Handler::BuildDOM.3
Manifying blib/man3/XML::DOM::DocumentFragment.3
Manifying blib/man3/XML::DOM::CDATASection.3
Manifying blib/man3/XML::DOM::AttlistDecl.3
Manifying blib/man3/XML::DOM::Node.3
Manifying blib/man3/XML::DOM::Notation.3
Manifying blib/man3/XML::DOM::PerlSAX.3
Manifying blib/man3/XML::DOM::ElementDecl.3
Manifying blib/man3/XML::DOM::Attr.3
Manifying blib/man3/XML::DOM::ProcessingInstruction.3
Manifying blib/man3/XML::DOM::DOMImplementation.3cp
lib/XML/DOM/EntityReference.pod
blib/lib/XML/DOM/EntityReference.pod
cp lib/XML/DOM/ElementDecl.pod
blib/lib/XML/DOM/ElementDecl.pod
cp lib/XML/DOM/Text.pod blib/lib/XML/DOM/Text.pod
cp lib/XML/DOM/NodeList.pod blib/lib/XML/DOM/NodeList.pod
cp lib/XML/DOM/CharacterData.pod
blib/lib/XML/DOM/CharacterData.pod
cp lib/XML/DOM/AttDef.pod blib/lib/XML/DOM/AttDef.pod
Manifying blib/man3/XML::DOM::Comment.3
Manifying blib/man3/XML::DOM.3
Manifying blib/man3/XML::DOM::DocumentType.3
Manifying blib/man3/XML::DOM::Element.3
Manifying blib/man3/XML::DOM::XMLDecl.3
Manifying blib/man3/XML::Handler::BuildDOM.3
Manifying blib/man3/XML::DOM::DocumentFragment.3
Manifying blib/man3/XML::DOM::CDATASection.3
Manifying blib/man3/XML::DOM::AttlistDecl.3
Manifying blib/man3/XML::DOM::Node.3
Manifying blib/man3/XML::DOM::Notation.3
Manifying blib/man3/XML::DOM::PerlSAX.3
Manifying blib/man3/XML::DOM::ElementDecl.3
Manifying blib/man3/XML::DOM::Attr.3
Manifying blib/man3/XML::DOM::ProcessingInstruction.3
Manifying blib/man3/XML::DOM::DOMImplementation.3
Manifying blib/man3/XML::DOM::Entity.3
Manifying blib/man3/XML::DOM::NamedNodeMap.3
Manifying blib/man3/XML::DOM::EntityReference.3
Manifying blib/man3/XML::DOM::Document.3
Manifying blib/man3/XML::DOM::CharacterData.3
Manifying blib/man3/XML::DOM::NodeList.3
Manifying blib/man3/XML::DOM::Text.3
Manifying blib/man3/XML::DOM::AttDef.3
Manifying blib/man3/XML::DOM::Parser.3
/usr/bin/make -- OK

Running make test
PERL_DL_NONLAZY=1 /usr/bin/perl
"-MExtUtils::Command::MM" "-e" "test_harness(0,
'blib/lib', 'blib/arch')" t/*.t
t/build_dom...........Can't locate
XML/Parser/PerlSAX.pm in @INC (@INC contains:
/root/.cpan/build/XML-DOM-1.42/blib/lib
/root/.cpan/build/XML-DOM-1.42/blib/arch
/usr/local/lib/perl5/5.8.0/i686-linux
/usr/local/lib/perl5/5.8.0/i686-linux
/usr/local/lib/perl5/5.8.0
/usr/local/lib/perl5/site_perl/5.8.0/i686-linux
/usr/local/lib/perl5/site_perl/5.8.0/i686-linux
/usr/local/lib/perl5/site_perl/5.8.0
/usr/local/lib/perl5/site_perl/5.8.0/i686-linux
/usr/local/lib/perl5/site_perl/5.8.0
/usr/local/lib/perl5/site_perl .
/usr/local/lib/perl5/5.8.0/i686-linux
/usr/local/lib/perl5/5.8.0
/usr/local/lib/perl5/site_perl/5.8.0/i686-linux
/usr/local/lib/perl5/site_perl/5.8.0
/usr/local/lib/perl5/site_perl .) at t/build_dom.t line 4.
BEGIN failed--compilation aborted at t/build_dom.t line 4.
t/build_dom...........dubious

Test returned status 2 (wstat 512, 0x200)
DIED. FAILED tests 1-2
Failed 2/2 tests, 0.00% okay
t/dom_astress.........ok

t/dom_attr............ok

t/dom_cdata...........ok

t/dom_documenttype....ok

t/dom_encode..........ok

t/dom_example.........ok

t/dom_extent..........ok

t/dom_jp_astress......ok

t/dom_jp_attr.........ok

t/dom_jp_cdata........ok

t/dom_jp_example......ok

t/dom_jp_minus........ok

t/dom_jp_modify.......ok

t/dom_jp_print........FAILED test 2

Failed 1/3 tests, 66.67% okay
t/dom_minus...........ok

t/dom_modify..........ok

t/dom_noexpand........ok

t/dom_print...........ok

t/dom_template........ok

t/dom_text............ok

Failed Test Stat Wstat Total Fail Failed List of
Failed
-------------------------------------------------------------------------------
t/build_dom.t 2 512 2 2 100.00% 1-2
t/dom_jp_print.t 3 1 33.33% 2
Failed 2/21 test scripts, 90.48% okay. 3/129 subtests
failed, 97.67% okay.
make: *** [test_dynamic] Error 29
/usr/bin/make test -- NOT OK
Running make install
make test had returned bad status, won't install
without force
Installation of XML::DOM failed.
Can't locate object method "new" via package
"XML::DOM::Parser" (perhaps you forgot to load
"XML::DOM::Parser"?) at ./setup.pl line 170.
Parsing OSD file at
file:/root/.cpan/build/XML-DOM-1.42/guido.osd...

Discussion

  • Nobody/Anonymous

    Logged In: NO

    This is the exact problem I had. XML::DOM::Parser problems

     
  • James Tillman

    James Tillman - 2003-05-10

    Logged In: YES
    user_id=1543

    I'm sorry to hear of your XML::DOM::Parser installation
    problems. While Guido will attempt to install the missing
    modules for you, I'm really not the best one to help
    troubleshoot their installation. If you'll contact the
    developers who work on the XML::DOM module and enlist their
    help in getting XML::DOM running on your system, Guido may
    install properly after XML::DOM is working.

     

Log in to post a comment.

Get latest updates about Open Source Projects, Conferences and News.

Sign up for the SourceForge newsletter:





No, thanks