SourceForge has been redesigned. Learn more.
Close

Installing GDL on AIX

Help
ale
2011-05-09
2013-06-03
  • ale

    ale - 2011-05-09

    Hi all.

    I need your help, if possible, about installing GDL on an AIX 5.3 machine.
    I installed plplot 5.9.7 but the gdl configure say:
    checking for plsexit in -lplplotcxxd… no

    Error! plplot library is required but was not found
           Use -with-plplot=DIR to specify the plplot directory tree

           (suitable Debian/Ubuntu packages: libplplot-dev, plplot9-driver-xwin)

    although I used the -with-plplotdir=/users/home/opt/plplot-5.9.7 option.

    These are my env vars:
    export CC=gcc
    export CXX=g++
    export CFLAGS=-maix64
    export CXXFLAGS=-maix64

    Thanks in advance for your support.
    Ale

     
  • Sylwester Arabas

    Hello,

    Please upload here your config.log file - there should be some info there on why the configure script is not finding plplot.
    You can also try the alternative build method - CMake (running "cmake ." instead of "./configure").

    Sylwester

     
  • ale

    ale - 2011-05-09

    Thanks a lot slayoo.
    Here is my config.log:

    This file contains any messages produced by compilers while
    running configure, to aid debugging if configure makes a mistake.

    It was created by gdl configure 0.9 CVS, which was
    generated by GNU Autoconf 2.67.  Invocation command line was

      $ ./configure -prefix=/users/home/opt/gdl-0.9.1 -with-plplotdir=/users/home/opt/plplot-5.9.7 -with-netcdf=/usr/local/netcdf-3.6.3 -with-hdf5=/usr/local/hdf5 -with-udunits=/usr/local/udunits-2.1.19 -with-x -with-openmp=no

    ## ------ ##
    ## Platform. ##
    ## ------ ##

    hostname = n30-csm
    uname -m = 00C050E24C00
    uname -r = 3
    uname -s = AIX
    uname -v = 5

    /usr/bin/uname -p = powerpc
    /bin/uname -X     = unknown

    /bin/arch              = unknown
    /usr/bin/arch -k       = unknown
    /usr/convex/getsysinfo = unknown
    /usr/bin/hostinfo      = unknown
    /bin/machine           = unknown
    /usr/bin/oslevel       = 5.3.0.0
    /bin/universe          = unknown

    PATH: /opt/lsf/7.0/aix5-64/etc
    PATH: /opt/lsf/7.0/aix5-64/bin
    PATH: /usr/bin
    PATH: /etc
    PATH: /usr/sbin
    PATH: /bin
    PATH: /usr/ucb
    PATH: /users/home/sysm04/bin
    PATH: /usr/bin/X11
    PATH: /sbin
    PATH: /usr/lib/instl
    PATH: /usr/opt/ifor/ls/os/aix/bin
    PATH: /usr/lpp/LoadL/full/bin
    PATH: /usr/vac/bin
    PATH: /usr/vacpp/bin
    PATH: /usr/lpp/mmfs/bin
    PATH: /usr/local/mysql/bin
    PATH: .
    PATH: /usr/local/bin
    PATH: /usr/local/gmake/bin
    PATH: /usr/local/GMT4.5.1/bin
    PATH: /usr/local/GrADS
    PATH: /usr/local/NCL/bin
    PATH: /usr/local/nedit-5.4
    PATH: /usr/local/netcdf-3.6.3/bin
    PATH: /usr/local/parallel-netcdf-1.03/bin
    PATH: /usr/local/bin

    ## ------- ##
    ## Core tests. ##
    ## ------- ##

    configure:2625: checking autoconf version
    configure:2628: result: >=2.62
    configure:2675: checking for a BSD-compatible install
    configure:2743: result: ./install-sh -c
    configure:2754: checking whether build environment is sane
    configure:2804: result: yes
    configure:2945: checking for a thread-safe mkdir -p
    configure:2984: result: ./install-sh -c -d
    configure:2997: checking for gawk
    configure:3027: result: no
    configure:2997: checking for mawk
    configure:3027: result: no
    configure:2997: checking for nawk
    configure:3013: found /usr/bin/nawk
    configure:3024: result: nawk
    configure:3035: checking whether make sets $(MAKE)
    configure:3057: result: yes
    configure:3257: checking for C++ compiler version
    configure:3266: g++ -version >&5
    g++ (GCC) 4.6.0
    Copyright (C) 2011 Free Software Foundation, Inc.
    This is free software; see the source for copying conditions.  There is NO
    warranty; not even for MERCHANTABILITY or FITNESS FOR A PARTICULAR PURPOSE.

    configure:3277: $? = 0
    configure:3266: g++ -v >&5
    Using built-in specs.
    COLLECT_GCC=g++
    COLLECT_LTO_WRAPPER=/opt/freeware/libexec/gcc/powerpc-ibm-aix5.3.0.0/4.6.0/lto-wrapper
    Target: powerpc-ibm-aix5.3.0.0
    Configured with: ../gcc-4.6.0/configure -with-as=/usr/bin/as -with-ld=/usr/bin/ld -enable-languages=c,c++,fortran -prefix=/opt/freeware -mandir=/opt/freeware/man -infodir=/opt/freeware/info -enable-threads -enable-version-specific-runtime-libs -disable-nls -enable-decimal-float=dpd -host=powerpc-ibm-aix5.3.0.0
    Thread model: aix
    gcc version 4.6.0 (GCC)
    configure:3277: $? = 0
    configure:3266: g++ -V >&5
    g++: error: unrecognized option '-V'
    g++: fatal error: no input files
    compilation terminated.
    configure:3277: $? = 1
    configure:3266: g++ -qversion >&5
    g++: error: unrecognized option '-qversion'
    g++: fatal error: no input files
    compilation terminated.
    configure:3277: $? = 1
    configure:3297: checking whether the C++ compiler works
    configure:3319: g++ -maix64   conftest.cpp  >&5
    configure:3323: $? = 0
    configure:3371: result: yes
    configure:3374: checking for C++ compiler default output file name
    configure:3376: result: a.out
    configure:3382: checking for suffix of executables
    configure:3389: g++ -o conftest -maix64   conftest.cpp  >&5
    configure:3393: $? = 0
    configure:3415: result:
    configure:3437: checking whether we are cross compiling
    configure:3445: g++ -o conftest -maix64   conftest.cpp  >&5
    configure:3449: $? = 0
    configure:3456: ./conftest
    configure:3460: $? = 0
    configure:3475: result: no
    configure:3480: checking for suffix of object files
    configure:3502: g++ -c -maix64  conftest.cpp >&5
    configure:3506: $? = 0
    configure:3527: result: o
    configure:3531: checking whether we are using the GNU C++ compiler
    configure:3550: g++ -c -maix64  conftest.cpp >&5
    configure:3550: $? = 0
    configure:3559: result: yes
    configure:3568: checking whether g++ accepts -g
    configure:3588: g++ -c -g  conftest.cpp >&5
    Assembler:
    /tmp//ccHxZDwT.s: line 39: Only .llong should be used for relocatable expressions.
    configure:3588: $? = 1
    configure: failed program was:
    | /* confdefs.h */
    | #define PACKAGE_NAME "gdl"
    | #define PACKAGE_TARNAME "gdl"
    | #define PACKAGE_VERSION "0.9 CVS"
    | #define PACKAGE_STRING "gdl 0.9 CVS"
    | #define PACKAGE_BUGREPORT ""
    | #define PACKAGE_URL ""
    | #define PACKAGE "gdl"
    | #define VERSION "0.9 CVS"
    | /* end confdefs.h.  */
    |
    | int
    | main ()
    | {
    |
    |   ;
    |   return 0;
    | }
    configure:3603: g++ -c   conftest.cpp >&5
    Assembler:
    /tmp//cck0MY2l.s: line 10: Only .llong should be used for relocatable expressions.
    configure:3603: $? = 1
    configure: failed program was:
    | /* confdefs.h */
    | #define PACKAGE_NAME "gdl"
    | #define PACKAGE_TARNAME "gdl"
    | #define PACKAGE_VERSION "0.9 CVS"
    | #define PACKAGE_STRING "gdl 0.9 CVS"
    | #define PACKAGE_BUGREPORT ""
    | #define PACKAGE_URL ""
    | #define PACKAGE "gdl"
    | #define VERSION "0.9 CVS"
    | /* end confdefs.h.  */
    |
    | int
    | main ()
    | {
    |
    |   ;
    |   return 0;
    | }
    configure:3619: g++ -c -g  conftest.cpp >&5
    Assembler:
    /tmp//ccUafx0V.s: line 39: Only .llong should be used for relocatable expressions.
    configure:3619: $? = 1
    configure: failed program was:
    | /* confdefs.h */
    | #define PACKAGE_NAME "gdl"
    | #define PACKAGE_TARNAME "gdl"
    | #define PACKAGE_VERSION "0.9 CVS"
    | #define PACKAGE_STRING "gdl 0.9 CVS"
    | #define PACKAGE_BUGREPORT ""
    | #define PACKAGE_URL ""
    | #define PACKAGE "gdl"
    | #define VERSION "0.9 CVS"
    | /* end confdefs.h.  */
    |
    | int
    | main ()
    | {
    |
    |   ;
    |   return 0;
    | }
    configure:3629: result: no
    configure:3663: checking for style of include used by make
    configure:3691: result: GNU
    configure:3716: checking dependency style of g++
    configure:3826: result: gcc3
    configure:3884: checking for ranlib
    configure:3900: found /usr/bin/ranlib
    configure:3911: result: ranlib
    configure:3962: checking build system type
    configure:3976: result: powerpc-ibm-aix5.3.0.0
    configure:3996: checking host system type
    configure:4009: result: powerpc-ibm-aix5.3.0.0
    configure:4077: checking for gcc
    configure:4104: result: gcc
    configure:4333: checking for C compiler version
    configure:4342: gcc -version >&5
    gcc (GCC) 4.6.0
    Copyright (C) 2011 Free Software Foundation, Inc.
    This is free software; see the source for copying conditions.  There is NO
    warranty; not even for MERCHANTABILITY or FITNESS FOR A PARTICULAR PURPOSE.

    configure:4353: $? = 0
    configure:4342: gcc -v >&5
    Using built-in specs.
    COLLECT_GCC=gcc
    COLLECT_LTO_WRAPPER=/opt/freeware/libexec/gcc/powerpc-ibm-aix5.3.0.0/4.6.0/lto-wrapper
    Target: powerpc-ibm-aix5.3.0.0
    Configured with: ../gcc-4.6.0/configure -with-as=/usr/bin/as -with-ld=/usr/bin/ld -enable-languages=c,c++,fortran -prefix=/opt/freeware -mandir=/opt/freeware/man -infodir=/opt/freeware/info -enable-threads -enable-version-specific-runtime-libs -disable-nls -enable-decimal-float=dpd -host=powerpc-ibm-aix5.3.0.0
    Thread model: aix
    gcc version 4.6.0 (GCC)
    configure:4353: $? = 0
    configure:4342: gcc -V >&5
    gcc: error: unrecognized option '-V'
    gcc: fatal error: no input files
    compilation terminated.
    configure:4353: $? = 1
    configure:4342: gcc -qversion >&5
    gcc: error: unrecognized option '-qversion'
    gcc: fatal error: no input files
    compilation terminated.
    configure:4353: $? = 1
    configure:4357: checking whether we are using the GNU C compiler
    configure:4376: gcc -c -maix64  conftest.c >&5
    configure:4376: $? = 0
    configure:4385: result: yes
    configure:4394: checking whether gcc accepts -g
    configure:4414: gcc -c -g  conftest.c >&5
    Assembler:
    /tmp//ccmokgrR.s: line 14: Only .llong should be used for relocatable expressions.
    configure:4414: $? = 1
    configure: failed program was:
    | /* confdefs.h */
    | #define PACKAGE_NAME "gdl"
    | #define PACKAGE_TARNAME "gdl"
    | #define PACKAGE_VERSION "0.9 CVS"
    | #define PACKAGE_STRING "gdl 0.9 CVS"
    | #define PACKAGE_BUGREPORT ""
    | #define PACKAGE_URL ""
    | #define PACKAGE "gdl"
    | #define VERSION "0.9 CVS"
    | /* end confdefs.h.  */
    |
    | int
    | main ()
    | {
    |
    |   ;
    |   return 0;
    | }
    configure:4429: gcc -c   conftest.c >&5
    Assembler:
    /tmp//ccVyEJMk.s: line 10: Only .llong should be used for relocatable expressions.
    configure:4429: $? = 1
    configure: failed program was:
    | /* confdefs.h */
    | #define PACKAGE_NAME "gdl"
    | #define PACKAGE_TARNAME "gdl"
    | #define PACKAGE_VERSION "0.9 CVS"
    | #define PACKAGE_STRING "gdl 0.9 CVS"
    | #define PACKAGE_BUGREPORT ""
    | #define PACKAGE_URL ""
    | #define PACKAGE "gdl"
    | #define VERSION "0.9 CVS"
    | /* end confdefs.h.  */
    |
    | int
    | main ()
    | {
    |
    |   ;
    |   return 0;
    | }
    configure:4445: gcc -c -g  conftest.c >&5
    Assembler:
    /tmp//ccRgNgs1.s: line 14: Only .llong should be used for relocatable expressions.
    configure:4445: $? = 1
    configure: failed program was:
    | /* confdefs.h */
    | #define PACKAGE_NAME "gdl"
    | #define PACKAGE_TARNAME "gdl"
    | #define PACKAGE_VERSION "0.9 CVS"
    | #define PACKAGE_STRING "gdl 0.9 CVS"
    | #define PACKAGE_BUGREPORT ""
    | #define PACKAGE_URL ""
    | #define PACKAGE "gdl"
    | #define VERSION "0.9 CVS"
    | /* end confdefs.h.  */
    |
    | int
    | main ()
    | {
    |
    |   ;
    |   return 0;
    | }
    configure:4455: result: no
    configure:4472: checking for gcc option to accept ISO C89
    configure:4536: gcc  -c -maix64  conftest.c >&5
    configure:4536: $? = 0
    configure:4549: result: none needed
    configure:4571: checking dependency style of gcc
    configure:4681: result: gcc3
    configure:4696: checking for a sed that does not truncate output
    configure:4760: result: /usr/bin/sed
    configure:4778: checking for grep that handles long lines and -e
    configure:4836: result: /usr/bin/grep
    configure:4841: checking for egrep
    configure:4903: result: /usr/bin/grep -E
    configure:4908: checking for fgrep
    configure:4970: result: /usr/bin/grep -F
    configure:5005: checking for ld used by gcc
    configure:5072: result: /usr/bin/ld
    configure:5079: checking if the linker (/usr/bin/ld) is GNU ld
    configure:5094: result: no
    configure:5106: checking for BSD- or MS-compatible name lister (nm)
    configure:5155: result: /usr/bin/nm -B
    configure:5273: checking the name lister (/usr/bin/nm -B) interface
    configure:5280: g++ -c -maix64  conftest.cpp >&5
    configure:5283: /usr/bin/nm -B "conftest.o"
    configure:5286: output
            16 d TOC
             0 D some_variable
    configure:5293: result: BSD nm
    configure:5296: checking whether ln -s works
    configure:5300: result: yes
    configure:5308: checking the maximum length of command line arguments
    configure:5428: result: 92160
    configure:5445: checking whether the shell understands some XSI constructs
    configure:5455: result: yes
    configure:5459: checking whether the shell understands "+="
    configure:5465: result: no
    configure:5500: checking for /usr/bin/ld option to reload object files
    configure:5507: result: -r
    configure:5576: checking for objdump
    configure:5606: result: no
    configure:5635: checking how to recognize dependent libraries
    configure:5831: result: pass_all
    configure:5891: checking for ar
    configure:5907: found /usr/bin/ar
    configure:5918: result: ar
    configure:5996: checking for strip
    configure:6012: found /usr/bin/strip
    configure:6023: result: strip
    configure:6095: checking for ranlib
    configure:6122: result: ranlib
    configure:6212: checking command to parse /usr/bin/nm -B output from gcc object
    configure:6330: g++ -c -maix64  conftest.cpp >&5
    configure:6333: $? = 0
    configure:6337: /usr/bin/nm -B conftest.o \| sed -n -e 's/^.*\(*\)*\(*\)$/\1 \2 \2/p' \> conftest.nm
    configure:6340: $? = 0
    configure:6394: g++ -o conftest -maix64   conftest.cpp conftstm.o >&5
    configure:6397: $? = 0
    configure:6435: result: ok
    configure:7244: checking how to run the C preprocessor
    configure:7275: gcc -E  conftest.c
    configure:7275: $? = 0
    configure:7289: gcc -E  conftest.c
    conftest.c:11:28: fatal error: ac_nonexistent.h: No such file or directory
    compilation terminated.
    configure:7289: $? = 1
    configure: failed program was:
    | /* confdefs.h */
    | #define PACKAGE_NAME "gdl"
    | #define PACKAGE_TARNAME "gdl"
    | #define PACKAGE_VERSION "0.9 CVS"
    | #define PACKAGE_STRING "gdl 0.9 CVS"
    | #define PACKAGE_BUGREPORT ""
    | #define PACKAGE_URL ""
    | #define PACKAGE "gdl"
    | #define VERSION "0.9 CVS"
    | /* end confdefs.h.  */
    | #include <ac_nonexistent.h>
    configure:7314: result: gcc -E
    configure:7334: gcc -E  conftest.c
    configure:7334: $? = 0
    configure:7348: gcc -E  conftest.c
    conftest.c:11:28: fatal error: ac_nonexistent.h: No such file or directory
    compilation terminated.
    configure:7348: $? = 1
    configure: failed program was:
    | /* confdefs.h */
    | #define PACKAGE_NAME "gdl"
    | #define PACKAGE_TARNAME "gdl"
    | #define PACKAGE_VERSION "0.9 CVS"
    | #define PACKAGE_STRING "gdl 0.9 CVS"
    | #define PACKAGE_BUGREPORT ""
    | #define PACKAGE_URL ""
    | #define PACKAGE "gdl"
    | #define VERSION "0.9 CVS"
    | /* end confdefs.h.  */
    | #include <ac_nonexistent.h>
    configure:7377: checking for ANSI C header files
    configure:7397: gcc -c -maix64  conftest.c >&5
    configure:7397: $? = 0
    configure:7470: gcc -o conftest -maix64   conftest.c  >&5
    configure:7470: $? = 0
    configure:7470: ./conftest
    configure:7470: $? = 0
    configure:7481: result: yes
    configure:7494: checking for sys/types.h
    configure:7494: gcc -c -maix64  conftest.c >&5
    configure:7494: $? = 0
    configure:7494: result: yes
    configure:7494: checking for sys/stat.h
    configure:7494: gcc -c -maix64  conftest.c >&5
    configure:7494: $? = 0
    configure:7494: result: yes
    configure:7494: checking for stdlib.h
    configure:7494: gcc -c -maix64  conftest.c >&5
    configure:7494: $? = 0
    configure:7494: result: yes
    configure:7494: checking for string.h
    configure:7494: gcc -c -maix64  conftest.c >&5
    configure:7494: $? = 0
    configure:7494: result: yes
    configure:7494: checking for memory.h
    configure:7494: gcc -c -maix64  conftest.c >&5
    configure:7494: $? = 0
    configure:7494: result: yes
    configure:7494: checking for strings.h
    configure:7494: gcc -c -maix64  conftest.c >&5
    configure:7494: $? = 0
    configure:7494: result: yes
    configure:7494: checking for inttypes.h
    configure:7494: gcc -c -maix64  conftest.c >&5
    configure:7494: $? = 0
    configure:7494: result: yes
    configure:7494: checking for stdint.h
    configure:7494: gcc -c -maix64  conftest.c >&5
    configure:7494: $? = 0
    configure:7494: result: yes
    configure:7494: checking for unistd.h
    configure:7494: gcc -c -maix64  conftest.c >&5
    configure:7494: $? = 0
    configure:7494: result: yes
    configure:7508: checking for dlfcn.h
    configure:7508: gcc -c -maix64  conftest.c >&5
    configure:7508: $? = 0
    configure:7508: result: yes
    configure:7633: checking for C++ compiler version
    configure:7642: g++ -version >&5
    g++ (GCC) 4.6.0
    Copyright (C) 2011 Free Software Foundation, Inc.
    This is free software; see the source for copying conditions.  There is NO
    warranty; not even for MERCHANTABILITY or FITNESS FOR A PARTICULAR PURPOSE.

    configure:7653: $? = 0
    configure:7642: g++ -v >&5
    Using built-in specs.
    COLLECT_GCC=g++
    COLLECT_LTO_WRAPPER=/opt/freeware/libexec/gcc/powerpc-ibm-aix5.3.0.0/4.6.0/lto-wrapper
    Target: powerpc-ibm-aix5.3.0.0
    Configured with: ../gcc-4.6.0/configure -with-as=/usr/bin/as -with-ld=/usr/bin/ld -enable-languages=c,c++,fortran -prefix=/opt/freeware -mandir=/opt/freeware/man -infodir=/opt/freeware/info -enable-threads -enable-version-specific-runtime-libs -disable-nls -enable-decimal-float=dpd -host=powerpc-ibm-aix5.3.0.0
    Thread model: aix
    gcc version 4.6.0 (GCC)
    configure:7653: $? = 0
    configure:7642: g++ -V >&5
    g++: error: unrecognized option '-V'
    g++: fatal error: no input files
    compilation terminated.
    configure:7653: $? = 1
    configure:7642: g++ -qversion >&5
    g++: error: unrecognized option '-qversion'
    g++: fatal error: no input files
    compilation terminated.
    configure:7653: $? = 1
    configure:7657: checking whether we are using the GNU C++ compiler
    configure:7685: result: yes
    configure:7694: checking whether g++ accepts -g
    configure:7755: result: no
    configure:7780: checking dependency style of g++
    configure:7890: result: gcc3
    configure:7913: checking how to run the C++ preprocessor
    configure:7940: g++ -E  conftest.cpp
    configure:7940: $? = 0
    configure:7954: g++ -E  conftest.cpp
    conftest.cpp:22:28: fatal error: ac_nonexistent.h: No such file or directory
    compilation terminated.
    configure:7954: $? = 1
    configure: failed program was:
    | /* confdefs.h */
    | #define PACKAGE_NAME "gdl"
    | #define PACKAGE_TARNAME "gdl"
    | #define PACKAGE_VERSION "0.9 CVS"
    | #define PACKAGE_STRING "gdl 0.9 CVS"
    | #define PACKAGE_BUGREPORT ""
    | #define PACKAGE_URL ""
    | #define PACKAGE "gdl"
    | #define VERSION "0.9 CVS"
    | #define STDC_HEADERS 1
    | #define HAVE_SYS_TYPES_H 1
    | #define HAVE_SYS_STAT_H 1
    | #define HAVE_STDLIB_H 1
    | #define HAVE_STRING_H 1
    | #define HAVE_MEMORY_H 1
    | #define HAVE_STRINGS_H 1
    | #define HAVE_INTTYPES_H 1
    | #define HAVE_STDINT_H 1
    | #define HAVE_UNISTD_H 1
    | #define HAVE_DLFCN_H 1
    | /* end confdefs.h.  */
    | #include <ac_nonexistent.h>
    configure:7979: result: g++ -E
    configure:7999: g++ -E  conftest.cpp
    configure:7999: $? = 0
    configure:8013: g++ -E  conftest.cpp
    conftest.cpp:22:28: fatal error: ac_nonexistent.h: No such file or directory
    compilation terminated.
    configure:8013: $? = 1
    configure: failed program was:
    | /* confdefs.h */
    | #define PACKAGE_NAME "gdl"
    | #define PACKAGE_TARNAME "gdl"
    | #define PACKAGE_VERSION "0.9 CVS"
    | #define PACKAGE_STRING "gdl 0.9 CVS"
    | #define PACKAGE_BUGREPORT ""
    | #define PACKAGE_URL ""
    | #define PACKAGE "gdl"
    | #define VERSION "0.9 CVS"
    | #define STDC_HEADERS 1
    | #define HAVE_SYS_TYPES_H 1
    | #define HAVE_SYS_STAT_H 1
    | #define HAVE_STDLIB_H 1
    | #define HAVE_STRING_H 1
    | #define HAVE_MEMORY_H 1
    | #define HAVE_STRINGS_H 1
    | #define HAVE_INTTYPES_H 1
    | #define HAVE_STDINT_H 1
    | #define HAVE_UNISTD_H 1
    | #define HAVE_DLFCN_H 1
    | /* end confdefs.h.  */
    | #include <ac_nonexistent.h>
    configure:8219: checking for objdir
    configure:8234: result: .libs
    configure:8526: checking if gcc supports -fno-rtti -fno-exceptions
    configure:8544: gcc -c -maix64  -fno-rtti -fno-exceptions conftest.c >&5
    cc1: warning: command line option '-fno-rtti' is valid for C++/ObjC++ but not for C
    configure:8548: $? = 0
    configure:8561: result: no
    configure:8581: checking for gcc option to produce PIC
    configure:8853: result:  -DPIC
    configure:8865: checking if gcc PIC flag  -DPIC works
    configure:8883: gcc -c -maix64   -DPIC -DPIC conftest.c >&5
    configure:8887: $? = 0
    configure:8900: result: yes
    configure:8924: checking if gcc static flag -static works
    configure:8952: result: no
    configure:8967: checking if gcc supports -c -o file.o
    configure:8988: gcc -c -maix64  -o out/conftest2.o conftest.c >&5
    configure:8992: $? = 0
    configure:9014: result: yes
    configure:9022: checking if gcc supports -c -o file.o
    configure:9069: result: yes
    configure:9102: checking whether the gcc linker (/usr/bin/ld) supports shared libraries
    configure:9600: gcc -o conftest -maix64   conftest.c  >&5
    configure:9600: $? = 0
    configure:10093: result: yes
    configure:10332: checking dynamic linker characteristics
    configure:10995: result: aix5.3.0.0 ld.so
    configure:11097: checking how to hardcode library paths into programs
    configure:11122: result: immediate
    configure:11642: checking whether stripping libraries is possible
    configure:11664: result: no
    configure:11682: checking if libtool supports shared libraries
    configure:11684: result: yes
    configure:11687: checking whether to build shared libraries
    configure:11708: result: yes
    configure:11711: checking whether to build static libraries
    configure:11715: result: no
    configure:11865: checking for ld used by g++
    configure:11932: result: /usr/bin/ld
    configure:11939: checking if the linker (/usr/bin/ld) is GNU ld
    configure:11954: result: no
    configure:12009: checking whether the g++ linker (/usr/bin/ld) supports shared libraries
    configure:12162: g++ -o conftest -maix64   conftest.cpp  >&5
    configure:12162: $? = 0
    configure:12922: result: yes
    configure:12950: g++ -c -maix64  conftest.cpp >&5
    configure:12953: $? = 0
    configure:13135: checking for g++ option to produce PIC
    configure:13452: result:  -DPIC
    configure:13461: checking if g++ PIC flag  -DPIC works
    configure:13479: g++ -c -maix64   -DPIC -DPIC conftest.cpp >&5
    configure:13483: $? = 0
    configure:13496: result: yes
    configure:13517: checking if g++ static flag -static works
    configure:13545: result: no
    configure:13557: checking if g++ supports -c -o file.o
    configure:13578: g++ -c -maix64  -o out/conftest2.o conftest.cpp >&5
    configure:13582: $? = 0
    configure:13604: result: yes
    configure:13609: checking if g++ supports -c -o file.o
    configure:13656: result: yes
    configure:13686: checking whether the g++ linker (/usr/bin/ld) supports shared libraries
    configure:13715: result: yes
    configure:13852: checking dynamic linker characteristics
    configure:14463: result: aix5.3.0.0 ld.so
    configure:14514: checking how to hardcode library paths into programs
    configure:14539: result: immediate
    configure:14606: checking for 64-bit OS
    configure:14616: gcc -o conftest -maix64   conftest.c  >&5
    configure:14616: $? = 0
    configure:14616: ./conftest
    configure:14616: $? = 0
    configure:14625: result: yes
    configure:14640: checking for library containing dlopen
    configure:14671: g++ -o conftest -maix64   conftest.cpp  >&5
    configure:14671: $? = 0
    configure:14688: result: none required
    configure:14726: checking for malloc_zone_statistics
    configure:14726: g++ -o conftest -maix64   conftest.cpp  >&5
    ld: 0711-317 ERROR: Undefined symbol: .malloc_zone_statistics
    ld: 0711-345 Use the -bloadmap or -bnoquiet option to obtain more information.
    collect2: ld returned 8 exit status
    configure:14726: $? = 1
    configure: failed program was:
    | /* confdefs.h */
    | #define PACKAGE_NAME "gdl"
    | #define PACKAGE_TARNAME "gdl"
    | #define PACKAGE_VERSION "0.9 CVS"
    | #define PACKAGE_STRING "gdl 0.9 CVS"
    | #define PACKAGE_BUGREPORT ""
    | #define PACKAGE_URL ""
    | #define PACKAGE "gdl"
    | #define VERSION "0.9 CVS"
    | #define STDC_HEADERS 1
    | #define HAVE_SYS_TYPES_H 1
    | #define HAVE_SYS_STAT_H 1
    | #define HAVE_STDLIB_H 1
    | #define HAVE_STRING_H 1
    | #define HAVE_MEMORY_H 1
    | #define HAVE_STRINGS_H 1
    | #define HAVE_INTTYPES_H 1
    | #define HAVE_STDINT_H 1
    | #define HAVE_UNISTD_H 1
    | #define HAVE_DLFCN_H 1
    | #define LT_OBJDIR ".libs/"
    | #define HAVE_64BIT_OS 1
    | /* end confdefs.h.  */
    | /* Define malloc_zone_statistics to an innocuous variant, in case <limits.h> declares malloc_zone_statistics.
    |    For example, HP-UX 11i <limits.h> declares gettimeofday.  */
    | #define malloc_zone_statistics innocuous_malloc_zone_statistics
    |
    | /* System header to define __stub macros and hopefully few prototypes,
    |     which can conflict with char malloc_zone_statistics (); below.
    |     Prefer <limits.h> to <assert.h> if __STDC__ is defined, since
    |     <limits.h> exists even on freestanding compilers.  */
    |
    | #ifdef __STDC__
    | # include <limits.h>
    | #else
    | # include <assert.h>
    | #endif
    |
    | #undef malloc_zone_statistics
    |
    | /* Override any GCC internal prototype to avoid an error.
    |    Use char because int might match the return type of a GCC
    |    builtin and then its argument prototype would still apply.  */
    | #ifdef __cplusplus
    | extern "C"
    | #endif
    | char malloc_zone_statistics ();
    | /* The GNU C library defines this for functions which it implements
    |     to always fail with ENOSYS.  Some functions are actually named
    |     something starting with __ and the normal name is an alias.  */
    | #if defined __stub_malloc_zone_statistics || defined __stub___malloc_zone_statistics
    | choke me
    | #endif
    |
    | int
    | main ()
    | {
    | return malloc_zone_statistics ();
    |   ;
    |   return 0;
    | }
    configure:14726: result: no
    configure:14726: checking for sbrk
    configure:14726: g++ -o conftest -maix64   conftest.cpp  >&5
    configure:14726: $? = 0
    configure:14726: result: yes
    configure:14726: checking for mallinfo
    configure:14726: g++ -o conftest -maix64   conftest.cpp  >&5
    configure:14726: $? = 0
    configure:14726: result: yes
    configure:14739: checking malloc.h usability
    configure:14739: g++ -c -maix64  conftest.cpp >&5
    configure:14739: $? = 0
    configure:14739: result: yes
    configure:14739: checking malloc.h presence
    configure:14739: g++ -E  conftest.cpp
    configure:14739: $? = 0
    configure:14739: result: yes
    configure:14739: checking for malloc.h
    configure:14739: result: yes
    configure:14739: checking malloc/malloc.h usability
    configure:14739: g++ -c -maix64  conftest.cpp >&5
    conftest.cpp:60:27: fatal error: malloc/malloc.h: No such file or directory
    compilation terminated.
    configure:14739: $? = 1
    configure: failed program was:
    | /* confdefs.h */
    | #define PACKAGE_NAME "gdl"
    | #define PACKAGE_TARNAME "gdl"
    | #define PACKAGE_VERSION "0.9 CVS"
    | #define PACKAGE_STRING "gdl 0.9 CVS"
    | #define PACKAGE_BUGREPORT ""
    | #define PACKAGE_URL ""
    | #define PACKAGE "gdl"
    | #define VERSION "0.9 CVS"
    | #define STDC_HEADERS 1
    | #define HAVE_SYS_TYPES_H 1
    | #define HAVE_SYS_STAT_H 1
    | #define HAVE_STDLIB_H 1
    | #define HAVE_STRING_H 1
    | #define HAVE_MEMORY_H 1
    | #define HAVE_STRINGS_H 1
    | #define HAVE_INTTYPES_H 1
    | #define HAVE_STDINT_H 1
    | #define HAVE_UNISTD_H 1
    | #define HAVE_DLFCN_H 1
    | #define LT_OBJDIR ".libs/"
    | #define HAVE_64BIT_OS 1
    | #define HAVE_SBRK 1
    | #define HAVE_MALLINFO 1
    | #define HAVE_MALLOC_H 1
    | /* end confdefs.h.  */
    | #include <stdio.h>
    | #ifdef HAVE_SYS_TYPES_H
    | # include <sys/types.h>
    | #endif
    | #ifdef HAVE_SYS_STAT_H
    | # include <sys/stat.h>
    | #endif
    | #ifdef STDC_HEADERS
    | # include <stdlib.h>
    | # include <stddef.h>
    | #else
    | # ifdef HAVE_STDLIB_H
    | #  include <stdlib.h>
    | # endif
    | #endif
    | #ifdef HAVE_STRING_H
    | # if !defined STDC_HEADERS && defined HAVE_MEMORY_H
    | #  include <memory.h>
    | # endif
    | # include <string.h>
    | #endif
    | #ifdef HAVE_STRINGS_H
    | # include <strings.h>
    | #endif
    | #ifdef HAVE_INTTYPES_H
    | # include <inttypes.h>
    | #endif
    | #ifdef HAVE_STDINT_H
    | # include <stdint.h>
    | #endif
    | #ifdef HAVE_UNISTD_H
    | # include <unistd.h>
    | #endif
    | #include <malloc/malloc.h>
    configure:14739: result: no
    configure:14739: checking malloc/malloc.h presence
    configure:14739: g++ -E  conftest.cpp
    conftest.cpp:27:27: fatal error: malloc/malloc.h: No such file or directory
    compilation terminated.
    configure:14739: $? = 1
    configure: failed program was:
    | /* confdefs.h */
    | #define PACKAGE_NAME "gdl"
    | #define PACKAGE_TARNAME "gdl"
    | #define PACKAGE_VERSION "0.9 CVS"
    | #define PACKAGE_STRING "gdl 0.9 CVS"
    | #define PACKAGE_BUGREPORT ""
    | #define PACKAGE_URL ""
    | #define PACKAGE "gdl"
    | #define VERSION "0.9 CVS"
    | #define STDC_HEADERS 1
    | #define HAVE_SYS_TYPES_H 1
    | #define HAVE_SYS_STAT_H 1
    | #define HAVE_STDLIB_H 1
    | #define HAVE_STRING_H 1
    | #define HAVE_MEMORY_H 1
    | #define HAVE_STRINGS_H 1
    | #define HAVE_INTTYPES_H 1
    | #define HAVE_STDINT_H 1
    | #define HAVE_UNISTD_H 1
    | #define HAVE_DLFCN_H 1
    | #define LT_OBJDIR ".libs/"
    | #define HAVE_64BIT_OS 1
    | #define HAVE_SBRK 1
    | #define HAVE_MALLINFO 1
    | #define HAVE_MALLOC_H 1
    | /* end confdefs.h.  */
    | #include <malloc/malloc.h>
    configure:14739: result: no
    configure:14739: checking for malloc/malloc.h
    configure:14739: result: no
    configure:14752: checking locale.h usability
    configure:14752: g++ -c -maix64  conftest.cpp >&5
    configure:14752: $? = 0
    configure:14752: result: yes
    configure:14752: checking locale.h presence
    configure:14752: g++ -E  conftest.cpp
    configure:14752: $? = 0
    configure:14752: result: yes
    configure:14752: checking for locale.h
    configure:14752: result: yes
    configure:14765: checking for nexttoward
    configure:14765: g++ -o conftest -maix64   conftest.cpp  >&5
    configure:14765: $? = 0
    configure:14765: result: yes
    configure:14785: checking for initscr in -lncurses
    configure:14810: g++ -o conftest -maix64   conftest.cpp -lncurses   >&5
    collect2: library libncurses not found
    configure:14810: $? = 1
    configure: failed program was:
    | /* confdefs.h */
    | #define PACKAGE_NAME "gdl"
    | #define PACKAGE_TARNAME "gdl"
    | #define PACKAGE_VERSION "0.9 CVS"
    | #define PACKAGE_STRING "gdl 0.9 CVS"
    | #define PACKAGE_BUGREPORT ""
    | #define PACKAGE_URL ""
    | #define PACKAGE "gdl"
    | #define VERSION "0.9 CVS"
    | #define STDC_HEADERS 1
    | #define HAVE_SYS_TYPES_H 1
    | #define HAVE_SYS_STAT_H 1
    | #define HAVE_STDLIB_H 1
    | #define HAVE_STRING_H 1
    | #define HAVE_MEMORY_H 1
    | #define HAVE_STRINGS_H 1
    | #define HAVE_INTTYPES_H 1
    | #define HAVE_STDINT_H 1
    | #define HAVE_UNISTD_H 1
    | #define HAVE_DLFCN_H 1
    | #define LT_OBJDIR ".libs/"
    | #define HAVE_64BIT_OS 1
    | #define HAVE_SBRK 1
    | #define HAVE_MALLINFO 1
    | #define HAVE_MALLOC_H 1
    | #define HAVE_LOCALE_H 1
    | #define HAVE_NEXTTOWARD 1
    | /* end confdefs.h.  */
    |
    | /* Override any GCC internal prototype to avoid an error.
    |    Use char because int might match the return type of a GCC
    |    builtin and then its argument prototype would still apply.  */
    | #ifdef __cplusplus
    | extern "C"
    | #endif
    | char initscr ();
    | int
    | main ()
    | {
    | return initscr ();
    |   ;
    |   return 0;
    | }
    configure:14819: result: no
    configure:14827: checking for initscr in -lcurses
    configure:14852: g++ -o conftest -maix64   conftest.cpp -lcurses   >&5
    configure:14852: $? = 0
    configure:14861: result: yes
    configure:14892: checking for stifle_history in -lreadline
    configure:14917: g++ -o conftest -maix64   conftest.cpp -lreadline  -lcurses  -lreadline >&5
    configure:14917: $? = 0
    configure:14926: result: yes
    configure:14945: checking for rl_get_screen_size in -lreadline
    configure:14970: g++ -o conftest -maix64   conftest.cpp -lreadline  -lcurses  -lreadline >&5
    configure:14970: $? = 0
    configure:14979: result: yes
    configure:15022: checking for gzopen in -lz
    configure:15047: g++ -o conftest -maix64   conftest.cpp -lz  -lcurses  -lreadline -lz >&5
    configure:15047: $? = 0
    configure:15056: result: yes
    configure:15148: checking for gsl_ran_binomial_knuth in -lgsl
    configure:15173: g++ -o conftest -maix64   conftest.cpp -lgsl  -lcurses  -lreadline -lz -lgsl -lgslcblas >&5
    configure:15173: $? = 0
    configure:15182: result: yes
    configure:15201: checking for cblas_drot in -lgslcblas
    configure:15226: g++ -o conftest -maix64   conftest.cpp -lgslcblas  -lgsl -lcurses  -lreadline -lz -lgsl -lgslcblas >&5
    configure:15226: $? = 0
    configure:15235: result: yes
    configure:15293: checking for plsexit in -lplplotcxxd
    configure:15318: g++ -o conftest -maix64   conftest.cpp -lplplotcxxd  -lgslcblas -lgsl -lcurses  -lreadline -lz -lgsl -lgslcblas -L/users/home/opt/plplot-5.9.7/lib -lplplotd -lplplotcxxd >&5
    ld: 0711-224 WARNING: Duplicate symbol: .bcopy
    ld: 0711-224 WARNING: Duplicate symbol: .memmove
    ld: 0711-345 Use the -bloadmap or -bnoquiet option to obtain more information.
    ld: 0711-317 ERROR: Undefined symbol: .btimeqsas
    ld: 0711-317 ERROR: Undefined symbol: .configqsas
    ld: 0711-317 ERROR: Undefined symbol: .ctimeqsas
    ld: 0711-317 ERROR: Undefined symbol: .pthread_mutexattr_init
    ld: 0711-317 ERROR: Undefined symbol: .pthread_mutexattr_settype
    ld: 0711-317 ERROR: Undefined symbol: .pthread_mutex_init
    ld: 0711-317 ERROR: Undefined symbol: .pthread_mutex_lock
    ld: 0711-317 ERROR: Undefined symbol: .pthread_mutex_unlock
    ld: 0711-317 ERROR: Undefined symbol: .pthread_attr_init
    ld: 0711-317 ERROR: Undefined symbol: .pthread_attr_setdetachstate
    ld: 0711-317 ERROR: Undefined symbol: .pthread_create
    ld: 0711-317 ERROR: Undefined symbol: .pthread_mutex_destroy
    ld: 0711-317 ERROR: Undefined symbol: .XDrawLine
    ld: 0711-317 ERROR: Undefined symbol: .XSetFunction
    ld: 0711-317 ERROR: Undefined symbol: .XDrawLines
    ld: 0711-317 ERROR: Undefined symbol: .XFlush
    ld: 0711-317 ERROR: Undefined symbol: .XClearWindow
    ld: 0711-317 ERROR: Undefined symbol: .XSetForeground
    ld: 0711-317 ERROR: Undefined symbol: .XFillRectangle
    ld: 0711-317 ERROR: Undefined symbol: .XSync
    ld: 0711-317 ERROR: Undefined symbol: .pthread_cancel
    ld: 0711-317 ERROR: Undefined symbol: .pthread_join
    ld: 0711-317 ERROR: Undefined symbol: .XDestroyWindow
    ld: 0711-317 ERROR: Undefined symbol: .XFreePixmap
    ld: 0711-317 ERROR: Undefined symbol: .XFreeGC
    ld: 0711-317 ERROR: Undefined symbol: .XCloseDisplay
    ld: 0711-317 ERROR: Undefined symbol: .XSetLineAttributes
    ld: 0711-317 ERROR: Undefined symbol: .XAllocColor
    ld: 0711-317 ERROR: Undefined symbol: .XNextEvent
    ld: 0711-317 ERROR: Undefined symbol: .XFillPolygon
    ld: 0711-317 ERROR: Undefined symbol: .XInitThreads
    ld: 0711-317 ERROR: Undefined symbol: .XOpenDisplay
    ld: 0711-317 ERROR: Undefined symbol: .XSynchronize
    ld: 0711-317 ERROR: Undefined symbol: .XSetWindowColormap
    ld: 0711-317 ERROR: Undefined symbol: .XCreateGC
    ld: 0711-317 ERROR: Undefined symbol: .XGetGeometry
    ld: 0711-317 ERROR: Undefined symbol: .XSetWindowBackground
    ld: 0711-317 ERROR: Undefined symbol: .XSetBackground
    ld: 0711-317 ERROR: Undefined symbol: .XCreateWindow
    ld: 0711-317 ERROR: Undefined symbol: .XSetStandardProperties
    ld: 0711-317 ERROR: Undefined symbol: .XSelectInput
    ld: 0711-317 ERROR: Undefined symbol: .XMapRaised
    ld: 0711-317 ERROR: Undefined symbol: .XInternAtom
    ld: 0711-317 ERROR: Undefined symbol: .XSetWMProtocols
    ld: 0711-317 ERROR: Undefined symbol: .XWindowEvent
    ld: 0711-317 ERROR: Undefined symbol: .XCheckWindowEvent
    ld: 0711-317 ERROR: Undefined symbol: .pthread_setcanceltype
    ld: 0711-317 ERROR: Undefined symbol: .pthread_setcancelstate
    ld: 0711-317 ERROR: Undefined symbol: .XCheckTypedWindowEvent
    ld: 0711-317 ERROR: Undefined symbol: .XLookupString
    ld: 0711-317 ERROR: Undefined symbol: .XWarpPointer
    ld: 0711-317 ERROR: Undefined symbol: .XCreateFontCursor
    ld: 0711-317 ERROR: Undefined symbol: .XDefineCursor
    ld: 0711-317 ERROR: Undefined symbol: .XQueryPointer
    ld: 0711-317 ERROR: Undefined symbol: .XUndefineCursor
    ld: 0711-317 ERROR: Undefined symbol: .XPending
    ld: 0711-317 ERROR: Undefined symbol: .XCopyArea
    ld: 0711-317 ERROR: Undefined symbol: .XGetErrorText
    ld: 0711-317 ERROR: Undefined symbol: .XSetErrorHandler
    ld: 0711-317 ERROR: Undefined symbol: .XCreatePixmap
    ld: 0711-317 ERROR: Undefined symbol: .XGetVisualInfo
    ld: 0711-317 ERROR: Undefined symbol: .XAllocColorCells
    ld: 0711-317 ERROR: Undefined symbol: .XFreeColors
    ld: 0711-317 ERROR: Undefined symbol: .XStoreColor
    ld: 0711-317 ERROR: Undefined symbol: .XQueryColors
    ld: 0711-317 ERROR: Undefined symbol: .XCreateColormap
    ld: 0711-317 ERROR: Undefined symbol: .XAllocNamedColor
    ld: 0711-317 ERROR: Undefined symbol: .XFree
    ld: 0711-317 ERROR: Undefined symbol: .XGetImage
    ld: 0711-317 ERROR: Undefined symbol: .XPutImage
    ld: 0711-317 ERROR: Undefined symbol: .closeqsas
    collect2: ld returned 8 exit status
    configure:15318: $? = 1
    configure: failed program was:
    | /* confdefs.h */
    | #define PACKAGE_NAME "gdl"
    | #define PACKAGE_TARNAME "gdl"
    | #define PACKAGE_VERSION "0.9 CVS"
    | #define PACKAGE_STRING "gdl 0.9 CVS"
    | #define PACKAGE_BUGREPORT ""
    | #define PACKAGE_URL ""
    | #define PACKAGE "gdl"
    | #define VERSION "0.9 CVS"
    | #define STDC_HEADERS 1
    | #define HAVE_SYS_TYPES_H 1
    | #define HAVE_SYS_STAT_H 1
    | #define HAVE_STDLIB_H 1
    | #define HAVE_STRING_H 1
    | #define HAVE_MEMORY_H 1
    | #define HAVE_STRINGS_H 1
    | #define HAVE_INTTYPES_H 1
    | #define HAVE_STDINT_H 1
    | #define HAVE_UNISTD_H 1
    | #define HAVE_DLFCN_H 1
    | #define LT_OBJDIR ".libs/"
    | #define HAVE_64BIT_OS 1
    | #define HAVE_SBRK 1
    | #define HAVE_MALLINFO 1
    | #define HAVE_MALLOC_H 1
    | #define HAVE_LOCALE_H 1
    | #define HAVE_NEXTTOWARD 1
    | #define HAVE_LIBCURSES 1
    | #define HAVE_LIBREADLINE 1
    | #define RL_GET_SCREEN_SIZE 1
    | #define HAVE_LIBZ 1
    | #define HAVE_LIBGSL 1
    | #define HAVE_LIBGSLCBLAS 1
    | /* end confdefs.h.  */
    |
    | /* Override any GCC internal prototype to avoid an error.
    |    Use char because int might match the return type of a GCC
    |    builtin and then its argument prototype would still apply.  */
    | #ifdef __cplusplus
    | extern "C"
    | #endif
    | char plsexit ();
    | int
    | main ()
    | {
    | return plsexit ();
    |   ;
    |   return 0;
    | }
    configure:15327: result: no

    ## ----------- ##
    ## Cache variables. ##
    ## ----------- ##

    ac_cv_build=powerpc-ibm-aix5.3.0.0
    ac_cv_c_compiler_gnu=yes
    ac_cv_cxx_compiler_gnu=yes
    ac_cv_env_CCC_set=''
    ac_cv_env_CCC_value=''
    ac_cv_env_CC_set=set
    ac_cv_env_CC_value=gcc
    ac_cv_env_CFLAGS_set=set
    ac_cv_env_CFLAGS_value=-maix64
    ac_cv_env_CPPFLAGS_set=''
    ac_cv_env_CPPFLAGS_value=''
    ac_cv_env_CPP_set=''
    ac_cv_env_CPP_value=''
    ac_cv_env_CXXCPP_set=''
    ac_cv_env_CXXCPP_value=''
    ac_cv_env_CXXFLAGS_set=set
    ac_cv_env_CXXFLAGS_value=-maix64
    ac_cv_env_CXX_set=set
    ac_cv_env_CXX_value=g++
    ac_cv_env_LDFLAGS_set=''
    ac_cv_env_LDFLAGS_value=''
    ac_cv_env_LIBS_set=''
    ac_cv_env_LIBS_value=''
    ac_cv_env_XMKMF_set=''
    ac_cv_env_XMKMF_value=''
    ac_cv_env_build_alias_set=''
    ac_cv_env_build_alias_value=''
    ac_cv_env_host_alias_set=''
    ac_cv_env_host_alias_value=''
    ac_cv_env_target_alias_set=''
    ac_cv_env_target_alias_value=''
    ac_cv_func_mallinfo=yes
    ac_cv_func_malloc_zone_statistics=no
    ac_cv_func_nexttoward=yes
    ac_cv_func_sbrk=yes
    ac_cv_header_dlfcn_h=yes
    ac_cv_header_inttypes_h=yes
    ac_cv_header_locale_h=yes
    ac_cv_header_malloc_h=yes
    ac_cv_header_malloc_malloc_h=no
    ac_cv_header_memory_h=yes
    ac_cv_header_stdc=yes
    ac_cv_header_stdint_h=yes
    ac_cv_header_stdlib_h=yes
    ac_cv_header_string_h=yes
    ac_cv_header_strings_h=yes
    ac_cv_header_sys_stat_h=yes
    ac_cv_header_sys_types_h=yes
    ac_cv_header_unistd_h=yes
    ac_cv_host=powerpc-ibm-aix5.3.0.0
    ac_cv_lib_curses_initscr=yes
    ac_cv_lib_gsl_gsl_ran_binomial_knuth=yes
    ac_cv_lib_gslcblas_cblas_drot=yes
    ac_cv_lib_ncurses_initscr=no
    ac_cv_lib_plplotcxxd_plsexit=no
    ac_cv_lib_readline_rl_get_screen_size=yes
    ac_cv_lib_readline_stifle_history=yes
    ac_cv_lib_z_gzopen=yes
    ac_cv_objext=o
    ac_cv_path_EGREP='/usr/bin/grep -E'
    ac_cv_path_FGREP='/usr/bin/grep -F'
    ac_cv_path_GREP=/usr/bin/grep
    ac_cv_path_SED=/usr/bin/sed
    ac_cv_prog_AWK=nawk
    ac_cv_prog_CPP='gcc -E'
    ac_cv_prog_CXXCPP='g++ -E'
    ac_cv_prog_ac_ct_AR=ar
    ac_cv_prog_ac_ct_CC=gcc
    ac_cv_prog_ac_ct_RANLIB=ranlib
    ac_cv_prog_ac_ct_STRIP=strip
    ac_cv_prog_cc_c89=''
    ac_cv_prog_cc_g=no
    ac_cv_prog_cxx_g=no
    ac_cv_prog_make_make_set=yes
    ac_cv_search_dlopen='none required'
    am_cv_CC_dependencies_compiler_type=gcc3
    am_cv_CXX_dependencies_compiler_type=gcc3
    lt_cv_deplibs_check_method=pass_all
    lt_cv_file_magic_cmd='$MAGIC_CMD'
    lt_cv_file_magic_test_file=''
    lt_cv_ld_reload_flag=-r
    lt_cv_nm_interface='BSD nm'
    lt_cv_objdir=.libs
    lt_cv_path_LD=/usr/bin/ld
    lt_cv_path_LDCXX=/usr/bin/ld
    lt_cv_path_NM='/usr/bin/nm -B'
    lt_cv_prog_compiler_c_o=yes
    lt_cv_prog_compiler_c_o_CXX=yes
    lt_cv_prog_compiler_pic_works=yes
    lt_cv_prog_compiler_pic_works_CXX=yes
    lt_cv_prog_compiler_rtti_exceptions=no
    lt_cv_prog_compiler_static_works=no
    lt_cv_prog_compiler_static_works_CXX=no
    lt_cv_prog_gnu_ld=no
    lt_cv_prog_gnu_ldcxx=no
    lt_cv_sys_global_symbol_pipe='sed -n -e '\''s/^.*\(*\)*\(*\)$/\1 \2 \2/p'\'
    lt_cv_sys_global_symbol_to_c_name_address='sed -n -e '\''s/^: \(*\) $/  {\"\1\", (void *) 0},/p'\'' -e '\''s/^* \(*\) \(*\)$/  {"\2", (void *) \&amp;\2},/p'\'
    lt_cv_sys_global_symbol_to_c_name_address_lib_prefix='sed -n -e '\''s/^: \(*\) $/  {\"\1\", (void *) 0},/p'\'' -e '\''s/^* \(*\) \(lib*\)$/  {"\2", (void *) \&amp;\2},/p'\'' -e '\''s/^* \(*\) \(*\)$/  {"lib\2", (void *) \&amp;\2},/p'\'
    lt_cv_sys_global_symbol_to_cdecl='sed -n -e '\''s/^T .* \(.*\)$/extern int \1();/p'\'' -e '\''s/^* .* \(.*\)$/extern char \1;/p'\'
    lt_cv_sys_max_cmd_len=92160

    ## ----------- ##
    ## Output variables. ##
    ## ----------- ##

    ACLOCAL='${SHELL} /users/home/sysm04/data/Software/gdl-0.9.1/missing -run aclocal-1.11'
    AMDEPBACKSLASH='\'
    AMDEP_FALSE='#'
    AMDEP_TRUE=''
    AMTAR='${SHELL} /users/home/sysm04/data/Software/gdl-0.9.1/missing -run tar'
    AR='ar'
    AUTOCONF='${SHELL} /users/home/sysm04/data/Software/gdl-0.9.1/missing -run autoconf'
    AUTOHEADER='${SHELL} /users/home/sysm04/data/Software/gdl-0.9.1/missing -run autoheader'
    AUTOMAKE='${SHELL} /users/home/sysm04/data/Software/gdl-0.9.1/missing -run automake-1.11'
    AWK='nawk'
    BUILDASLIBRARY_FALSE=''
    BUILDASLIBRARY_TRUE='#'
    CC='gcc'
    CCDEPMODE='depmode=gcc3'
    CFLAGS='-maix64'
    CPP='gcc -E'
    CPPFLAGS=''
    CXX='g++'
    CXXCPP='g++ -E'
    CXXDEPMODE='depmode=gcc3'
    CXXFLAGS='-maix64'
    CYGPATH_W='echo'
    DARWIN_FALSE=''
    DARWIN_TRUE=''
    DEFS=''
    DEPDIR='.deps'
    DSYMUTIL=''
    DUMPBIN=''
    ECHO_C='\c'
    ECHO_N=''
    ECHO_T=''
    EGREP='/usr/bin/grep -E'
    EXEC_PREFIX=''
    EXEEXT=''
    EXT_INCLUDES=''
    EXT_LIBS=''
    FGREP='/usr/bin/grep -F'
    GDLDATADIR=''
    GREP='/usr/bin/grep'
    HAVE_64BIT_OS=''
    INSTALL_DATA='${INSTALL} -m 644'
    INSTALL_PROGRAM='${INSTALL}'
    INSTALL_SCRIPT='${INSTALL}'
    INSTALL_STRIP_PROGRAM='$(install_sh) -c -s'
    LD='/usr/bin/ld'
    LDFLAGS=''
    LIBOBJS=''
    LIBS='-lgslcblas -lgsl -lcurses  -lreadline -lz -lgsl -lgslcblas -L/users/home/opt/plplot-5.9.7/lib -lplplotd -lplplotcxxd'
    LIBTOOL='$(SHELL) $(top_builddir)/libtool'
    LIPO=''
    LN_S='ln -s'
    LTLIBOBJS=''
    MAKEINFO='${SHELL} /users/home/sysm04/data/Software/gdl-0.9.1/missing -run makeinfo'
    MKDIR_P='./install-sh -c -d'
    MagickConfig=''
    NM='/usr/bin/nm -B'
    NMEDIT=''
    OBJDUMP='false'
    OBJEXT='o'
    OTOOL64=''
    OTOOL=''
    PACKAGE='gdl'
    PACKAGE_BUGREPORT=''
    PACKAGE_NAME='gdl'
    PACKAGE_STRING='gdl 0.9 CVS'
    PACKAGE_TARNAME='gdl'
    PACKAGE_URL=''
    PACKAGE_VERSION='0.9 CVS'
    PATH_SEPARATOR=':'
    PYTHON=''
    PYTHON_EXEC_PREFIX=''
    PYTHON_PLATFORM=''
    PYTHON_PREFIX=''
    PYTHON_VERSION=''
    RANLIB='ranlib'
    SED='/usr/bin/sed'
    SET_MAKE=''
    SHELL='/bin/sh'
    STRIP='strip'
    VERSION='0.9 CVS'
    XMKMF=''
    ac_ct_CC='gcc'
    ac_ct_CXX=''
    ac_ct_DUMPBIN=''
    am__EXEEXT_FALSE=''
    am__EXEEXT_TRUE=''
    am__fastdepCC_FALSE='#'
    am__fastdepCC_TRUE=''
    am__fastdepCXX_FALSE='#'
    am__fastdepCXX_TRUE=''
    am__include='include'
    am__isrc=''
    am__leading_dot='.'
    am__quote=''
    am__tar='${AMTAR} chof - "$$tardir"'
    am__untar='${AMTAR} xf -'
    bindir='${exec_prefix}/bin'
    build='powerpc-ibm-aix5.3.0.0'
    build_alias=''
    build_cpu='powerpc'
    build_os='aix5.3.0.0'
    build_vendor='ibm'
    datadir='${datarootdir}'
    datarootdir='${prefix}/share'
    docdir='${datarootdir}/doc/${PACKAGE_TARNAME}'
    dvidir='${docdir}'
    exec_prefix='NONE'
    host='powerpc-ibm-aix5.3.0.0'
    host_alias=''
    host_cpu='powerpc'
    host_os='aix5.3.0.0'
    host_vendor='ibm'
    htmldir='${docdir}'
    includedir='${prefix}/include'
    infodir='${datarootdir}/info'
    install_sh='${SHELL} /users/home/sysm04/data/Software/gdl-0.9.1/install-sh'
    libdir='${exec_prefix}/lib'
    libexecdir='${exec_prefix}/libexec'
    localedir='${datarootdir}/locale'
    localstatedir='${prefix}/var'
    lt_ECHO='print -r'
    mandir='${datarootdir}/man'
    mkdir_p='$(top_builddir)/./install-sh -c -d'
    nc_config=''
    oldincludedir='/usr/include'
    pdfdir='${docdir}'
    pkgpyexecdir=''
    pkgpythondir=''
    prefix='/users/home/opt/gdl-0.9.1'
    program_transform_name='s,x,x,'
    psdir='${docdir}'
    pyexecdir=''
    pythondir=''
    sbindir='${exec_prefix}/sbin'
    sharedstatedir='${prefix}/com'
    sysconfdir='${prefix}/etc'
    target_alias=''
    wxConfig=''

    ## ------- ##
    ## confdefs.h. ##
    ## ------- ##

    /* confdefs.h */
    #define PACKAGE_NAME "gdl"
    #define PACKAGE_TARNAME "gdl"
    #define PACKAGE_VERSION "0.9 CVS"
    #define PACKAGE_STRING "gdl 0.9 CVS"
    #define PACKAGE_BUGREPORT ""
    #define PACKAGE_URL ""
    #define PACKAGE "gdl"
    #define VERSION "0.9 CVS"
    #define STDC_HEADERS 1
    #define HAVE_SYS_TYPES_H 1
    #define HAVE_SYS_STAT_H 1
    #define HAVE_STDLIB_H 1
    #define HAVE_STRING_H 1
    #define HAVE_MEMORY_H 1
    #define HAVE_STRINGS_H 1
    #define HAVE_INTTYPES_H 1
    #define HAVE_STDINT_H 1
    #define HAVE_UNISTD_H 1
    #define HAVE_DLFCN_H 1
    #define LT_OBJDIR ".libs/"
    #define HAVE_64BIT_OS 1
    #define HAVE_SBRK 1
    #define HAVE_MALLINFO 1
    #define HAVE_MALLOC_H 1
    #define HAVE_LOCALE_H 1
    #define HAVE_NEXTTOWARD 1
    #define HAVE_LIBCURSES 1
    #define HAVE_LIBREADLINE 1
    #define RL_GET_SCREEN_SIZE 1
    #define HAVE_LIBZ 1
    #define HAVE_LIBGSL 1
    #define HAVE_LIBGSLCBLAS 1

    configure: exit 0

     
  • ale

    ale - 2011-05-10

    As you suggested, I used cmake to build the package.
    The process runs well. But at the 99% (aaarggh!!) ends with error:

    Linking CXX executable gdl
    ld: 0711-224 WARNING: Duplicate symbol: .memmove
    ld: 0711-224 WARNING: Duplicate symbol: .bcopy
    ld: 0711-345 Use the -bloadmap or -bnoquiet option to obtain more information.
    ld: 0711-317 ERROR: Undefined symbol: .btimeqsas
    ld: 0711-317 ERROR: Undefined symbol: .configqsas
    ld: 0711-317 ERROR: Undefined symbol: .ctimeqsas
    ld: 0711-317 ERROR: Undefined symbol: .pthread_mutexattr_init
    ld: 0711-317 ERROR: Undefined symbol: .pthread_mutexattr_settype
    ld: 0711-317 ERROR: Undefined symbol: .pthread_mutex_init
    ld: 0711-317 ERROR: Undefined symbol: .pthread_mutex_lock
    ld: 0711-317 ERROR: Undefined symbol: .pthread_mutex_unlock
    ld: 0711-317 ERROR: Undefined symbol: .pthread_attr_init
    ld: 0711-317 ERROR: Undefined symbol: .pthread_attr_setdetachstate
    ld: 0711-317 ERROR: Undefined symbol: .pthread_create
    ld: 0711-317 ERROR: Undefined symbol: .pthread_mutex_destroy
    ld: 0711-317 ERROR: Undefined symbol: .pthread_cancel
    ld: 0711-317 ERROR: Undefined symbol: .pthread_join
    ld: 0711-317 ERROR: Undefined symbol: .pthread_setcanceltype
    ld: 0711-317 ERROR: Undefined symbol: .pthread_setcancelstate
    ld: 0711-317 ERROR: Undefined symbol: .closeqsas
    ld: 0711-317 ERROR: Undefined symbol: .strfqsas
    ld: 0711-317 ERROR: Undefined symbol: .csa_create
    ld: 0711-317 ERROR: Undefined symbol: .csa_addpoints
    ld: 0711-317 ERROR: Undefined symbol: .csa_calculatespline
    ld: 0711-317 ERROR: Undefined symbol: .csa_approximate_points
    ld: 0711-317 ERROR: Undefined symbol: .csa_destroy
    ld: 0711-317 ERROR: Undefined symbol: .XML_Parse
    ld: 0711-317 ERROR: Undefined symbol: .XML_GetCurrentLineNumber
    ld: 0711-317 ERROR: Undefined symbol: .XML_GetCurrentColumnNumber
    ld: 0711-317 ERROR: Undefined symbol: .XML_GetErrorCode
    ld: 0711-317 ERROR: Undefined symbol: .XML_ErrorString
    ld: 0711-317 ERROR: Undefined symbol: .XML_StopParser
    ld: 0711-317 ERROR: Undefined symbol: .XML_SetCharacterDataHandler
    ld: 0711-317 ERROR: Undefined symbol: .XML_GetBase
    ld: 0711-317 ERROR: Undefined symbol: .XML_ParserCreate
    ld: 0711-317 ERROR: Undefined symbol: .XML_SetBase
    ld: 0711-317 ERROR: Undefined symbol: .XML_ParserFree
    ld: 0711-317 ERROR: Undefined symbol: .XML_SetXmlDeclHandler
    ld: 0711-317 ERROR: Undefined symbol: .XML_SetElementHandler
    collect2: ld returned 8 exit status
    gmake: ***  Error 1
    gmake: ***  Error 2
    gmake: ***  Error 2

    I tried to launch the related g++ command in the src dir, adding "-lpthreads" to link pthreads library and some errors were solved:

    >//usr/bin/g++   -maix64   CMakeFiles/gdl.dir/CFMTLexer.cpp.o CMakeFiles/gdl.dir/FMTIn.cpp.o CMakeFiles/gdl.dir/FMTLexer.cpp.o CMakeFiles/gdl.dir/FMTOut.cpp.o CMakeFiles/gdl.dir/FMTParser.cpp.o CMakeFiles/gdl.dir/GDLInterpreter.cpp.o CMakeFiles/gdl.dir/GDLLexer.cpp.o CMakeFiles/gdl.dir/GDLParser.cpp.o CMakeFiles/gdl.dir/GDLTreeParser.cpp.o CMakeFiles/gdl.dir/arrayindex.cpp.o CMakeFiles/gdl.dir/assocdata.cpp.o CMakeFiles/gdl.dir/basegdl.cpp.o CMakeFiles/gdl.dir/basic_fun.cpp.o CMakeFiles/gdl.dir/basic_fun_cl.cpp.o CMakeFiles/gdl.dir/basic_fun_jmg.cpp.o CMakeFiles/gdl.dir/basic_op.cpp.o CMakeFiles/gdl.dir/basic_pro.cpp.o CMakeFiles/gdl.dir/basic_pro_jmg.cpp.o CMakeFiles/gdl.dir/color.cpp.o CMakeFiles/gdl.dir/convert2.cpp.o CMakeFiles/gdl.dir/convol.cpp.o CMakeFiles/gdl.dir/convol_inc0.cpp.o CMakeFiles/gdl.dir/convol_inc1.cpp.o CMakeFiles/gdl.dir/convol_inc2.cpp.o CMakeFiles/gdl.dir/datatypes.cpp.o CMakeFiles/gdl.dir/datatypesref.cpp.o CMakeFiles/gdl.dir/dcommon.cpp.o CMakeFiles/gdl.dir/dcompiler.cpp.o CMakeFiles/gdl.dir/default_io.cpp.o CMakeFiles/gdl.dir/dinterpreter.cpp.o CMakeFiles/gdl.dir/dnode.cpp.o CMakeFiles/gdl.dir/dpro.cpp.o CMakeFiles/gdl.dir/dstructdesc.cpp.o CMakeFiles/gdl.dir/dstructgdl.cpp.o CMakeFiles/gdl.dir/dvar.cpp.o CMakeFiles/gdl.dir/envt.cpp.o CMakeFiles/gdl.dir/extrat.cpp.o CMakeFiles/gdl.dir/fftw.cpp.o CMakeFiles/gdl.dir/file.cpp.o CMakeFiles/gdl.dir/fmtnode.cpp.o CMakeFiles/gdl.dir/gdleventhandler.cpp.o CMakeFiles/gdl.dir/gdlexception.cpp.o CMakeFiles/gdl.dir/gdlgstream.cpp.o CMakeFiles/gdl.dir/gdljournal.cpp.o CMakeFiles/gdl.dir/gdlpsstream.cpp.o CMakeFiles/gdl.dir/gdlpython.cpp.o CMakeFiles/gdl.dir/gdlsvgstream.cpp.o CMakeFiles/gdl.dir/gdlwidget.cpp.o CMakeFiles/gdl.dir/gdlwinstream.cpp.o CMakeFiles/gdl.dir/gdlxstream.cpp.o CMakeFiles/gdl.dir/gdlzstream.cpp.o CMakeFiles/gdl.dir/getfmtast.cpp.o CMakeFiles/gdl.dir/graphics.cpp.o CMakeFiles/gdl.dir/grib.cpp.o CMakeFiles/gdl.dir/gshhs.cpp.o CMakeFiles/gdl.dir/gsl_fun.cpp.o CMakeFiles/gdl.dir/hdf5_fun.cpp.o CMakeFiles/gdl.dir/hdf_fun.cpp.o CMakeFiles/gdl.dir/hdf_pro.cpp.o CMakeFiles/gdl.dir/ifmt.cpp.o CMakeFiles/gdl.dir/image.cpp.o CMakeFiles/gdl.dir/initct.cpp.o CMakeFiles/gdl.dir/initsysvar.cpp.o CMakeFiles/gdl.dir/io.cpp.o CMakeFiles/gdl.dir/lapack.cpp.o CMakeFiles/gdl.dir/libinit.cpp.o CMakeFiles/gdl.dir/libinit_ac.cpp.o CMakeFiles/gdl.dir/libinit_cl.cpp.o CMakeFiles/gdl.dir/libinit_gm.cpp.o CMakeFiles/gdl.dir/libinit_jmg.cpp.o CMakeFiles/gdl.dir/libinit_mes.cpp.o CMakeFiles/gdl.dir/libinit_ng.cpp.o CMakeFiles/gdl.dir/magick_cl.cpp.o CMakeFiles/gdl.dir/math_fun.cpp.o CMakeFiles/gdl.dir/math_fun_ac.cpp.o CMakeFiles/gdl.dir/math_fun_gm.cpp.o CMakeFiles/gdl.dir/math_fun_jmg.cpp.o CMakeFiles/gdl.dir/math_fun_ng.cpp.o CMakeFiles/gdl.dir/math_utl.cpp.o CMakeFiles/gdl.dir/mpi.cpp.o CMakeFiles/gdl.dir/ncdf_att_cl.cpp.o CMakeFiles/gdl.dir/ncdf_cl.cpp.o CMakeFiles/gdl.dir/ncdf_dim_cl.cpp.o CMakeFiles/gdl.dir/ncdf_var_cl.cpp.o CMakeFiles/gdl.dir/new.cpp.o CMakeFiles/gdl.dir/newprognode.cpp.o CMakeFiles/gdl.dir/objects.cpp.o CMakeFiles/gdl.dir/ofmt.cpp.o CMakeFiles/gdl.dir/plot3d_nr.cpp.o CMakeFiles/gdl.dir/plotting.cpp.o CMakeFiles/gdl.dir/print.cpp.o CMakeFiles/gdl.dir/print_tree.cpp.o CMakeFiles/gdl.dir/prognode.cpp.o CMakeFiles/gdl.dir/prognodeexpr.cpp.o CMakeFiles/gdl.dir/read.cpp.o CMakeFiles/gdl.dir/sigfpehandler.cpp.o CMakeFiles/gdl.dir/str.cpp.o CMakeFiles/gdl.dir/terminfo.cpp.o CMakeFiles/gdl.dir/topython.cpp.o CMakeFiles/gdl.dir/typetraits.cpp.o CMakeFiles/gdl.dir/widget.cpp.o CMakeFiles/gdl.dir/gdl.cpp.o  -o gdl  antlr/libantlr.a -ldl /usr/lib/libcurses.a /usr/lib/libreadline.a /usr/lib/libhistory.a /usr/lib/libz.a /usr/lib/libgsl.a /usr/lib/libgslcblas.a /users/home/opt/plplot-5.9.7/lib/libplplotd.a /users/home/opt/plplot-5.9.7/lib/libplplotcxxd.a /usr/local/netcdf-3.6.3/lib/libnetcdf.a /usr/local/hdf5/lib/libhdf5.a /usr/lib/libz.a /usr/lib/libm.a /usr/local/hdf5/lib/libhdf5_hl.a /usr/local/hdf5/lib/libhdf5.a /usr/lib/libz.a /usr/lib/libm.a /usr/local/udunits-2.1.19/lib/libudunits2.a /usr/lib/libSM.a /usr/lib/libICE.a /usr/lib/libX11.a /usr/lib/libXext.a /usr/lib/libgsl.a /usr/lib/libgslcblas.a /users/home/opt/plplot-5.9.7/lib/libplplotd.a /users/home/opt/plplot-5.9.7/lib/libplplotcxxd.a /usr/local/netcdf-3.6.3/lib/libnetcdf.a /usr/local/hdf5/lib/libhdf5_hl.a /usr/local/udunits-2.1.19/lib/libudunits2.a /usr/lib/libSM.a /usr/lib/libICE.a /usr/lib/libX11.a /usr/lib/libXext.a -Wl,-blibpath:/users/home/opt/plplot-5.9.7/lib:/usr/local/netcdf-3.6.3/lib:/usr/local/hdf5/lib:/usr/local/udunits-2.1.19/lib:/usr/lib:/lib -lpthreads

    ld: 0711-224 WARNING: Duplicate symbol: .memmove
    ld: 0711-224 WARNING: Duplicate symbol: .bcopy
    ld: 0711-345 Use the -bloadmap or -bnoquiet option to obtain more information.
    ld: 0711-317 ERROR: Undefined symbol: .btimeqsas
    ld: 0711-317 ERROR: Undefined symbol: .configqsas
    ld: 0711-317 ERROR: Undefined symbol: .ctimeqsas
    ld: 0711-317 ERROR: Undefined symbol: .closeqsas
    ld: 0711-317 ERROR: Undefined symbol: .strfqsas
    ld: 0711-317 ERROR: Undefined symbol: .csa_create
    ld: 0711-317 ERROR: Undefined symbol: .csa_addpoints
    ld: 0711-317 ERROR: Undefined symbol: .csa_calculatespline
    ld: 0711-317 ERROR: Undefined symbol: .csa_approximate_points
    ld: 0711-317 ERROR: Undefined symbol: .csa_destroy
    ld: 0711-317 ERROR: Undefined symbol: .XML_Parse
    ld: 0711-317 ERROR: Undefined symbol: .XML_GetCurrentLineNumber
    ld: 0711-317 ERROR: Undefined symbol: .XML_GetCurrentColumnNumber
    ld: 0711-317 ERROR: Undefined symbol: .XML_GetErrorCode
    ld: 0711-317 ERROR: Undefined symbol: .XML_ErrorString
    ld: 0711-317 ERROR: Undefined symbol: .XML_StopParser
    ld: 0711-317 ERROR: Undefined symbol: .XML_SetCharacterDataHandler
    ld: 0711-317 ERROR: Undefined symbol: .XML_GetBase
    ld: 0711-317 ERROR: Undefined symbol: .XML_ParserCreate
    ld: 0711-317 ERROR: Undefined symbol: .XML_SetBase
    ld: 0711-317 ERROR: Undefined symbol: .XML_ParserFree
    ld: 0711-317 ERROR: Undefined symbol: .XML_SetXmlDeclHandler
    ld: 0711-317 ERROR: Undefined symbol: .XML_SetElementHandler
    collect2: ld returned 8 exit status

    How can i solve, in your opinion, this trivial error?
    Thank you very much for your precious support.

     
  • Sylwester Arabas

    Hello,

    Perhaps checking the output of "dump -H <plplot shared library filename>" (never tried, but Google says it's the AIX equivalent of "ldd" on Linux) could help to figure out which other libraries it depends on?

    S.

     

Log in to post a comment.