#472 Build problem webkit branch

Current-devel-SVN
closed
build (39)
5
2012-09-15
2012-02-17
No

On a recent arch Linux 64 bit system building the webkit branch revision 4368 (and som before that) failes with

[ 44/130] cxx: src/main/configs.cc -> build/default/src/main/configs_1.o
[ 45/130] cxx: src/main/display.cc -> build/default/src/main/display_1.o
[ 46/130] cxx: src/main/export_passage.cc -> build/default/src/main/export_passage_1.o
../src/main/display.cc: In function 'void set_render_numbers(sword::SWModule&, GLOBAL_OPS*)':
../src/main/display.cc:768:8: error: 'class sword::OSISHTMLHREF' has no member named 'setRenderNoteNumbers'
../src/main/display.cc:771:8: error: 'class sword::ThMLHTMLHREF' has no member named 'setRenderNoteNumbers'
../src/main/display.cc:774:8: error: 'class sword::GBFHTMLHREF' has no member named 'setRenderNoteNumbers'
../src/main/display.cc:777:8: error: 'class sword::TEIHTMLHREF' has no member named 'setRenderNoteNumbers'
Waf: Leaving directory `/home/haawda/paketierung/maintained_by_me/xiphos-webkit-svn/src/xiphos-build/build'
Build failed: -> task failed (err #1):
{task: cxx display.cc -> display_1.o}
==> ERROR: A failure occurred in build().

Discussion


Log in to post a comment.