#1001 Compilation error with MinGW

v1.23.1
closed-fixed
nobody
v1.23.1
5
2015-01-24
2013-10-28
neoxeo
No

gtk/PlatGTK.cxx: In static member function 'static long int Platform::SendScinti
lla(WindowID, unsigned int, long unsigned int, long int)':
gtk/PlatGTK.cxx:2049:43: error: 'SCINTILLA' was not declared in this scope
return scintilla_send_message(SCINTILLA(w), msg, wParam, lParam);
^
gtk/PlatGTK.cxx:2049:65: error: 'scintilla_send_message' was not declared in thi
s scope
return scintilla_send_message(SCINTILLA(w), msg, wParam, lParam);
^
gtk/PlatGTK.cxx: In static member function 'static long int Platform::SendScinti
llaPointer(WindowID, unsigned int, long unsigned int, void)':
gtk/PlatGTK.cxx:2054:43: error: 'SCINTILLA' was not declared in this scope
return scintilla_send_message(SCINTILLA(w), msg, wParam,
^
gtk/PlatGTK.cxx:2055:64: error: 'scintilla_send_message' was not declared in thi
s scope
reinterpret_cast<sptr_t>(lParam));
^
gtk/PlatGTK.cxx: In static member function 'static long int Platform::SendScinti
lla(WindowID, unsigned int, long unsigned int, long int)':
gtk/PlatGTK.cxx:2050:1: warning: control reaches end of non-void function [-Wret
urn-type]

}
^
gtk/PlatGTK.cxx: In static member function 'static long int Platform::SendScinti
llaPointer(WindowID, unsigned int, long unsigned int, void
)':
gtk/PlatGTK.cxx:2056:1: warning: control reaches end of non-void function [-Wret
urn-type]

}
^
make[1]: [PlatGTK.o] Error 1
make[1]: Leaving directory `/e/Downloads/geany-1.23.1/scintilla'
make:
[all] Error 2

Discussion

<< < 1 2 (Page 2 of 2)
  • Nick Treleaven

    Nick Treleaven - 2015-01-24
    • status: open --> closed-fixed
     
<< < 1 2 (Page 2 of 2)

Log in to post a comment.