Probleme de compilation

Help
2006-11-10
2013-04-17
  • julien duponchelle

    Je tente de compiler gaim-netsoul sous kubuntu 6.10 avec un gaim 2.0.0beta3.1.

    Et j'obtient cette erreur:
    netsoul.h:31:22: error: internal.h: No such file or directory

    La compil complète:
    make  all-recursive
    make[1]: entrant dans le répertoire « /home/noplay/download/gaim-netsoul-0.2 »
    Making all in src
    make[2]: entrant dans le répertoire « /home/noplay/download/gaim-netsoul-0.2/src »
    if /bin/bash ../libtool --silent --tag=CC --mode=compile gcc -DHAVE_CONFIG_H -I. -I. -I..  -DLIBDIR=\"/usr/local/lib/gaim/\" -DDATADIR=\"/usr/local/share\" -I/usr/include/glib-2.0 -I/usr/lib/glib-2.0/include   -I/usr/include/gaim -I/usr/include/glib-2.0 -I/usr/lib/glib-2.0/include      -Wall -g3 -MT netsoul.lo -MD -MP -MF ".deps/netsoul.Tpo" -c -o netsoul.lo netsoul.c; \         then mv -f ".deps/netsoul.Tpo" ".deps/netsoul.Plo"; else rm -f ".deps/netsoul.Tpo"; exit 1; fi
    In file included from netsoul.c:24:
    netsoul.h:31:22: error: internal.h: No such file or directory
    netsoul.c: In function 'netsoul_close':
    netsoul.c:247: warning: implicit declaration of function 'close'
    netsoul.c: In function 'netsoul_get_buddies':
    netsoul.c:353: warning: unused variable 'gg'
    netsoul.c: In function 'netsoul_list_emblems':
    netsoul.c:490: warning: value computed is not used
    netsoul.c: At top level:
    netsoul.c:616: warning: implicit declaration of function 'N_'
    netsoul.c:616: error: initializer element is not constant
    netsoul.c:616: error: (near initialization for 'info.summary')
    netsoul.c:617: error: initializer element is not constant
    netsoul.c:617: error: (near initialization for 'info.description')
    netsoul.c:618: error: initializer element is not constant
    netsoul.c:618: error: (near initialization for 'info.author')
    netsoul.c: In function '_init_plugin':
    netsoul.c:633: warning: implicit declaration of function '_'
    netsoul.c:633: warning: passing argument 1 of 'gaim_account_option_string_new' makes pointer from integer without a cast
    netsoul.c:636: warning: passing argument 1 of 'gaim_account_option_int_new' makes pointer from integer without a cast
    netsoul.c:639: warning: passing argument 1 of 'gaim_account_option_string_new' makes pointer from integer without a cast
    netsoul.c:642: warning: passing argument 1 of 'gaim_account_option_string_new' makes pointer from integer without a cast
    make[2]: *** [netsoul.lo] Erreur 1
    make[2]: quittant le répertoire « /home/noplay/download/gaim-netsoul-0.2/src »
    make[1]: *** [all-recursive] Erreur 1
    make[1]: quittant le répertoire « /home/noplay/download/gaim-netsoul-0.2 »
    make: *** [all] Erreur 2

     
    • ridercop

      ridercop - 2007-02-06

      J'ai exactement le même problème sur ma debian etch et je n'ai jamais réussi à resoudre ce problème.
      Quelqu'un a réussi à le résoudre?
      Merci

       
    • Ced

      Ced - 2007-02-22

      recuperer la version du svn ca doit marcher maintenant avec la version beta 6.

       

Get latest updates about Open Source Projects, Conferences and News.

Sign up for the SourceForge newsletter:





No, thanks