Mike - 2010-05-22

CONFIGURATION SUMMARY
  audio transcoding plugins
    encoder:
      lame       : no
      twolame    : no
      pcm/wav    : yes
    decoder:
      vorbis     : yes (libvorbisfile)
      mpc        : no
      flac       : yes
      faad       : no (aac/mp4/m4a)
      mad        : no (mpeg Layer I, II & III)
  video transcoding plugins
    ffmpeg             : disabled
  image conversion/rescaling plugins
    ImageMagick        : enabled  (Wand C-API)
  audio metadata extraction plugins
    taglib             : enabled  (mp3, ogg, flac & mpc)
    mpeg4ip/mp4v2      : disabled (mp4/m4a)
  image metadata extraction plugins
    Exiv2              : enabled
    ImageMagick        : enabled  (Wand C-API)
    simage             : disabled (jpeg, png, gif, tiff, rgb, pic, tga, eps)
  video metadata extraction plugins
    libavformat        : enabled
    ffmpegthumbnailer  : disabled
  database plugins
    mysql              : disabled
  miscellaneous
    iconv              : enabled (charset conversion)
    uuid               : enabled
    inotify            : enabled
    vfolder            : enabled

/bin/sh ../libtool  --tag=CXX   --mode=compile g++ -DHAVE_CONFIG_H -I. -I/usr/include/dbus-1.0 -I/usr/lib/dbus-1.0/include   -I/usr/include/uuid   -I/usr/include/libxml2    -DFUPPES_DATADIR=\"/usr/local/share/fuppes\" -DFUPPES_PLUGINDIR=\"/usr/local/lib/fuppes\" -DFUPPES_SYSCONFDIR=\"/usr/local/etc/fuppes\"   -Wall -g -O2 -MT ContentDatabase.lo -MD -MP -MF .deps/ContentDatabase.Tpo -c -o ContentDatabase.lo `test -f 'lib/ContentDirectory/ContentDatabase.cpp' || echo './'`lib/ContentDirectory/ContentDatabase.cpp
libtool: compile:  g++ -DHAVE_CONFIG_H -I. -I/usr/include/dbus-1.0 -I/usr/lib/dbus-1.0/include -I/usr/include/uuid -I/usr/include/libxml2 -DFUPPES_DATADIR=\"/usr/local/share/fuppes\" -DFUPPES_PLUGINDIR=\"/usr/local/lib/fuppes\" -DFUPPES_SYSCONFDIR=\"/usr/local/etc/fuppes\" -Wall -g -O2 -MT ContentDatabase.lo -MD -MP -MF .deps/ContentDatabase.Tpo -c lib/ContentDirectory/ContentDatabase.cpp  -fPIC -DPIC -o .libs/ContentDatabase.o
In file included from lib/ContentDirectory/ContentDatabase.cpp:33:
lib/ContentDirectory/ContentDatabase.h:39:35: error: FileAlterationHandler.h: No such file or directory
lib/ContentDirectory/ContentDatabase.h:40:26: error: UpdateThread.h: No such file or directory
lib/ContentDirectory/ContentDatabase.cpp:43:21: error: HotPlug.h: No such file or directory
lib/ContentDirectory/ContentDatabase.cpp:45:28: error: DatabaseObject.h: No such file or directory
lib/ContentDirectory/ContentDatabase.cpp:546:2: warning: #warning device compatibility!?
lib/ContentDirectory/ContentDatabase.cpp:744:3: warning: #warning FIXME: object type
lib/ContentDirectory/ContentDatabase.cpp:848:2: warning: #warning FIXME
lib/ContentDirectory/ContentDatabase.cpp:1174:2: warning: #warning todo: remove fam watches
In file included from lib/ContentDirectory/ContentDatabase.cpp:33:
lib/ContentDirectory/ContentDatabase.h:132: error: ISO C++ forbids declaration of 'UpdateThread' with no type
lib/ContentDirectory/ContentDatabase.h:132: error: invalid use of '::'
lib/ContentDirectory/ContentDatabase.h:132: error: expected ';' before '*' token
lib/ContentDirectory/ContentDatabase.h:137: error: ISO C++ forbids declaration of 'FileAlterationHandler' with no type
lib/ContentDirectory/ContentDatabase.h:137: error: expected ';' before '*' token
lib/ContentDirectory/ContentDatabase.cpp: In constructor 'CContentDatabase::CContentDatabase()':
lib/ContentDirectory/ContentDatabase.cpp:86: error: 'm_fileAlterationHandler' was not declared in this scope
lib/ContentDirectory/ContentDatabase.cpp:86: error: expected type-specifier before 'FileAlterationHandler'
lib/ContentDirectory/ContentDatabase.cpp:86: error: expected ';' before 'FileAlterationHandler'
lib/ContentDirectory/ContentDatabase.cpp:89: error: 'm_updateThread' was not declared in this scope
lib/ContentDirectory/ContentDatabase.cpp:89: error: expected type-specifier before 'UpdateThread'
lib/ContentDirectory/ContentDatabase.cpp:89: error: expected ';' before 'UpdateThread'
lib/ContentDirectory/ContentDatabase.cpp:91: error: 'HotPlugMgr' has not been declared
lib/ContentDirectory/ContentDatabase.cpp: In destructor 'CContentDatabase::~CContentDatabase()':
lib/ContentDirectory/ContentDatabase.cpp:96: error: 'HotPlugMgr' has not been declared
lib/ContentDirectory/ContentDatabase.cpp:98: error: 'm_updateThread' was not declared in this scope
lib/ContentDirectory/ContentDatabase.cpp:100: error: 'm_fileAlterationHandler' was not declared in this scope
lib/ContentDirectory/ContentDatabase.cpp: In member function 'bool CContentDatabase::Init(bool*)':
lib/ContentDirectory/ContentDatabase.cpp:209: error: 'm_updateThread' was not declared in this scope
lib/ContentDirectory/ContentDatabase.cpp: In static member function 'static unsigned int CContentDatabase::insertFile(std::string, object_id_t, SQLQuery*, bool)':
lib/ContentDirectory/ContentDatabase.cpp:324: error: 'DbObject' was not declared in this scope
lib/ContentDirectory/ContentDatabase.cpp:324: error: 'file' was not declared in this scope
lib/ContentDirectory/ContentDatabase.cpp:324: error: 'DbObject' is not a class or namespace
lib/ContentDirectory/ContentDatabase.cpp:327: error: type '<type error>' argument given to 'delete', expected pointer
lib/ContentDirectory/ContentDatabase.cpp:349: error: 'parent' was not declared in this scope
lib/ContentDirectory/ContentDatabase.cpp:349: error: 'DbObject' is not a class or namespace
lib/ContentDirectory/ContentDatabase.cpp:355: error: type '<type error>' argument given to 'delete', expected pointer
lib/ContentDirectory/ContentDatabase.cpp:362: error: expected ';' before 'obj'
lib/ContentDirectory/ContentDatabase.cpp:363: error: 'obj' was not declared in this scope
lib/ContentDirectory/ContentDatabase.cpp: In static member function 'static unsigned int CContentDatabase::insertDirectory(std::string, std::string, object_id_t, SQLQuery*, bool)':
lib/ContentDirectory/ContentDatabase.cpp:381: error: 'DbObject' was not declared in this scope
lib/ContentDirectory/ContentDatabase.cpp:381: error: 'dir' was not declared in this scope
lib/ContentDirectory/ContentDatabase.cpp:381: error: 'DbObject' is not a class or namespace
lib/ContentDirectory/ContentDatabase.cpp:383: error: expected type-specifier before 'DbObject'
lib/ContentDirectory/ContentDatabase.cpp:383: error: expected ';' before 'DbObject'
lib/ContentDirectory/ContentDatabase.cpp:394: error: type '<type error>' argument given to 'delete', expected pointer
lib/ContentDirectory/ContentDatabase.cpp: In member function 'virtual void ScanDirectoryThread::run()':
lib/ContentDirectory/ContentDatabase.cpp:424: error: 'DbObject' was not declared in this scope
lib/ContentDirectory/ContentDatabase.cpp:424: error: 'parent' was not declared in this scope
lib/ContentDirectory/ContentDatabase.cpp:424: error: 'DbObject' is not a class or namespace
lib/ContentDirectory/ContentDatabase.cpp:428: error: type '<type error>' argument given to 'delete', expected pointer
lib/ContentDirectory/ContentDatabase.cpp: In member function 'void RebuildThread::DbScanDir(CContentDatabase*, SQLQuery*, std::string, long long int)':
lib/ContentDirectory/ContentDatabase.cpp:470: error: 'DbObject' was not declared in this scope
lib/ContentDirectory/ContentDatabase.cpp:470: error: expected ';' before 'obj'
lib/ContentDirectory/ContentDatabase.cpp:554: error: 'obj' was not declared in this scope
lib/ContentDirectory/ContentDatabase.cpp: In function 'void ParsePlaylist(CSQLResult*)':
lib/ContentDirectory/ContentDatabase.cpp:857: error: 'DbObject' was not declared in this scope
lib/ContentDirectory/ContentDatabase.cpp:857: error: 'existing' was not declared in this scope
lib/ContentDirectory/ContentDatabase.cpp:863: error: 'DbObject' is not a class or namespace
lib/ContentDirectory/ContentDatabase.cpp:872: error: 'object' was not declared in this scope
lib/ContentDirectory/ContentDatabase.cpp:872: error: expected type-specifier before 'DbObject'
lib/ContentDirectory/ContentDatabase.cpp:872: error: expected ';' before 'DbObject'
lib/ContentDirectory/ContentDatabase.cpp:877: error: type '<type error>' argument given to 'delete', expected pointer
lib/ContentDirectory/ContentDatabase.cpp:878: error: type '<type error>' argument given to 'delete', expected pointer
lib/ContentDirectory/ContentDatabase.cpp: In member function 'virtual void RebuildThread::run()':
lib/ContentDirectory/ContentDatabase.cpp:903: error: 'class CContentDatabase' has no member named 'm_updateThread'
lib/ContentDirectory/ContentDatabase.cpp:973: error: 'DbObject' was not declared in this scope
lib/ContentDirectory/ContentDatabase.cpp:973: error: expected ';' before 'obj'
lib/ContentDirectory/ContentDatabase.cpp:1001: error: 'obj' was not declared in this scope
lib/ContentDirectory/ContentDatabase.cpp:1069: error: 'class CContentDatabase' has no member named 'm_updateThread'
make[2]: *** [ContentDatabase.lo] Error 1
make[2]: Leaving directory `/home/mdomann/movies/source/fuppes/fuppes/src'
make[1]: *** [all] Error 2
make[1]: Leaving directory `/home/mdomann/movies/source/fuppes/fuppes/src'
make: *** [all-recursive] Error 1

i tried to build it now, but i get the error above. and it seems not that the missing files are in debian sid. (apt-file found nothing)

regards mike