|
From: Hanspeter N. <fi...@sn...> - 2025-11-29 20:38:00
|
On 11/29/25 11:39 AM, Luigi Ernesto Zanotti wrote:
> Hi all,
> I'm running on a Mojave system. During the last update-all I got the
> following error:
>
> MacAir-10:50:~> fink update-all
> Password:
> Information about 20161 packages read in 4 seconds.
> The following 2 packages will be installed or updated:
> libheif1-dev libheif1-shlibs
> Setting runtime build-lock...
> ............
> /sw/src/fink.build/libheif1-shlibs-1.20.2-1/libheif-1.20.2/examples/heif_info.cc:87:20: error:
> 'path' is unavailable: introduced in macOS 10.15
> std::filesystem::path p(argv0);
> ^
> /Applications/Xcode.app/Contents/Developer/Toolchains/XcodeDefault.xctoolchain/usr/bin/../include/c++/v1/filesystem:739:24: note:
> 'path' has been explicitly marked unavailable here
> class _LIBCPP_TYPE_VIS path {
> ^
> .............
> error repeats again for 5 times. Then:
>
> 6 errors generated.
> make[2]: *** [examples/CMakeFiles/heif-info.dir/heif_info.cc.o] Error 1
> make[1]: *** [examples/CMakeFiles/heif-info.dir/all] Error 2
> make: *** [all] Error 2
> ### execution of /tmp/fink.yjAaV failed, exit code 2
> ### execution of /tmp/fink.tZOc6 failed, exit code 2
> Removing runtime build-lock...
> Removing build-lock package...
> /sw/bin/dpkg-lockwait -r fink-buildlock-libheif1-shlibs-1.20.2-1
> (Reading database ... 333232 files and directories currently installed.)
> Removing fink-buildlock-libheif1-shlibs-1.20.2-1 ...
> Failed: phase compiling: libheif1-shlibs-1.20.2-1 failed
>
> Before reporting any errors, please run "fink selfupdate" and try again.
>
> If you continue to have issues, please check to see if the FAQ on Fink's
> website solves the problem. If not, ask on one (not both, please) of
> these mailing lists:
>
> The Fink Users List <fin...@li...>
> The Fink Beginners List <fin...@li...>,
>
> with a carbon copy to the maintainer:
>
> Daniel Macks <dm...@ne...>
>
> Note that this is preferable to emailing just the maintainer directly,
> since most fink package maintainers do not have access to all possible
> hardware and software configurations.
>
> Please try to include the complete error message in your report. This
> generally consists of a compiler line starting with e.g. "gcc" or "g++"
> followed by the actual error output from the compiler.
>
> Also include the following system information:
> Package manager version: 0.45.6
> Distribution version: selfupdate-git Thu Nov 27 10:43:23 2025, 10.14.5,
> x86_64
> Trees: local/main stable/main stable/crypto local/injected
> Xcode.app: 11.3.1
> Xcode command-line tools: 11.3.1.0.1.1576735732
> Max. Fink build jobs: 1
Confirming I also see this on 10.14.6 with the same settings as above.
The actual errors are for `path`, `filename`, and `string`, all
introduced on 10.15.
Hanspeter
--
+---------------------------+
| . o c , |
| `'#v-- --v#`' |
| /'> < \ |
+---------------------------+
| I fence, therefore I am. |
+---------------------------+
|