MacOSX, ghc 7.2.1, Eclipse Indigo, Stream.hsc

Help
2012-02-06
2012-12-06
  • Paul Monday

    Paul Monday - 2012-02-06

    I'm not having any luck getting EclipseFP installed.  I've been searching through the archives and there doesn't seem to be anything that relates to this particular problem.  It appears when the scion-browser is installing and building within Eclipse.  A different problem occurs from the command line when I try to cabal install scion browser.

    It appears that Stream.hsc fails to build from zlib.  This is a known problem:
    http://stackoverflow.com/questions/8961413/zlib-build-error-with-ghc

    I ended up building it in my user environment but this doesn't seem to import into the Eclipse environment.

    Where is EclipseFP being built in a Mac environment?

    Resolving dependencies…
    Configuring base-unicode-symbols-0.2.2.3…
    Preprocessing library base-unicode-symbols-0.2.2.3…
    Building base-unicode-symbols-0.2.2.3…
    Compiling Data.Ord.Unicode ( Data/Ord/Unicode.hs, dist/build/Data/Ord/Unicode.o )
    Compiling Data.Monoid.Unicode ( Data/Monoid/Unicode.hs, dist/build/Data/Monoid/Unicode.o )
    Compiling Data.List.Unicode ( Data/List/Unicode.hs, dist/build/Data/List/Unicode.o )
    Compiling Data.Function.Unicode ( Data/Function/Unicode.hs, dist/build/Data/Function/Unicode.o )
    Compiling Data.Foldable.Unicode ( Data/Foldable/Unicode.hs, dist/build/Data/Foldable/Unicode.o )
    Compiling Data.Eq.Unicode  ( Data/Eq/Unicode.hs, dist/build/Data/Eq/Unicode.o )
    Compiling Data.Bool.Unicode ( Data/Bool/Unicode.hs, dist/build/Data/Bool/Unicode.o )
    Compiling Prelude.Unicode  ( Prelude/Unicode.hs, dist/build/Prelude/Unicode.o )
    Compiling Control.Monad.Unicode ( Control/Monad/Unicode.hs, dist/build/Control/Monad/Unicode.o )
    Compiling Control.Applicative.Unicode ( Control/Applicative/Unicode.hs, dist/build/Control/Applicative/Unicode.o )
    Compiling Control.Category.Unicode ( Control/Category/Unicode.hs, dist/build/Control/Category/Unicode.o )
    Compiling Control.Arrow.Unicode ( Control/Arrow/Unicode.hs, dist/build/Control/Arrow/Unicode.o )
    Compiling Data.Ord.Unicode ( Data/Ord/Unicode.hs, dist/build/Data/Ord/Unicode.p_o )
    Compiling Data.Monoid.Unicode ( Data/Monoid/Unicode.hs, dist/build/Data/Monoid/Unicode.p_o )
    Compiling Data.List.Unicode ( Data/List/Unicode.hs, dist/build/Data/List/Unicode.p_o )
    Compiling Data.Function.Unicode ( Data/Function/Unicode.hs, dist/build/Data/Function/Unicode.p_o )
    Compiling Data.Foldable.Unicode ( Data/Foldable/Unicode.hs, dist/build/Data/Foldable/Unicode.p_o )
    Compiling Data.Eq.Unicode  ( Data/Eq/Unicode.hs, dist/build/Data/Eq/Unicode.p_o )
    Compiling Data.Bool.Unicode ( Data/Bool/Unicode.hs, dist/build/Data/Bool/Unicode.p_o )
    Compiling Prelude.Unicode  ( Prelude/Unicode.hs, dist/build/Prelude/Unicode.p_o )
    Compiling Control.Monad.Unicode ( Control/Monad/Unicode.hs, dist/build/Control/Monad/Unicode.p_o )
    Compiling Control.Applicative.Unicode ( Control/Applicative/Unicode.hs, dist/build/Control/Applicative/Unicode.p_o )
    Compiling Control.Category.Unicode ( Control/Category/Unicode.hs, dist/build/Control/Category/Unicode.p_o )
    Compiling Control.Arrow.Unicode ( Control/Arrow/Unicode.hs, dist/build/Control/Arrow/Unicode.p_o )
    Registering base-unicode-symbols-0.2.2.3…
    Running Haddock for base-unicode-symbols-0.2.2.3…
    Preprocessing library base-unicode-symbols-0.2.2.3…
    Warning: The documentation for the following packages are not installed. No
    links will be generated to these packages: ffi-1.0, rts-1.0
    haddock coverage for dist/build/tmp27529/Data/Ord/Unicode.hs:     5/5 100%
    haddock coverage for dist/build/tmp27529/Data/Monoid/Unicode.hs:     3/3 100%
    haddock coverage for dist/build/tmp27529/Data/List/Unicode.hs:   10/10 100%
    haddock coverage for dist/build/tmp27529/Data/Function/Unicode.hs:     2/2 100%
    haddock coverage for dist/build/tmp27529/Data/Foldable/Unicode.hs:     5/5 100%
    haddock coverage for dist/build/tmp27529/Data/Eq/Unicode.hs:     4/4 100%
    haddock coverage for dist/build/tmp27529/Data/Bool/Unicode.hs:     4/4 100%
    haddock coverage for dist/build/tmp27529/Prelude/Unicode.hs:   21/21 100%
    haddock coverage for dist/build/tmp27529/Control/Monad/Unicode.hs:     4/4 100%
    haddock coverage for dist/build/tmp27529/Control/Applicative/Unicode.hs:     3/3 100%
    haddock coverage for dist/build/tmp27529/Control/Category/Unicode.hs:     4/4 100%
    haddock coverage for dist/build/tmp27529/Control/Arrow/Unicode.hs:     6/6 100%
    Documentation created: dist/doc/html/base-unicode-symbols/index.html
    sudo: no tty present and no askpass program specified
    Configuring cpphs-1.13.2…
    Preprocessing library cpphs-1.13.2…
    Preprocessing executables for cpphs-1.13.2…
    Building cpphs-1.13.2…
    Compiling Language.Preprocessor.Cpphs.HashDefine ( Language/Preprocessor/Cpphs/HashDefine.hs, dist/build/Language/Preprocessor/Cpphs/HashDefine.o )
    Compiling Text.ParserCombinators.HuttonMeijer ( Text/ParserCombinators/HuttonMeijer.hs, dist/build/Text/ParserCombinators/HuttonMeijer.o )
    Compiling Language.Preprocessor.Cpphs.SymTab ( Language/Preprocessor/Cpphs/SymTab.hs, dist/build/Language/Preprocessor/Cpphs/SymTab.o )
    Compiling Language.Preprocessor.Unlit ( Language/Preprocessor/Unlit.hs, dist/build/Language/Preprocessor/Unlit.o )
    Compiling Language.Preprocessor.Cpphs.Options ( Language/Preprocessor/Cpphs/Options.hs, dist/build/Language/Preprocessor/Cpphs/Options.o )
    Compiling Language.Preprocessor.Cpphs.Position ( Language/Preprocessor/Cpphs/Position.hs, dist/build/Language/Preprocessor/Cpphs/Position.o )
    Compiling Language.Preprocessor.Cpphs.ReadFirst ( Language/Preprocessor/Cpphs/ReadFirst.hs, dist/build/Language/Preprocessor/Cpphs/ReadFirst.o )
    Compiling Language.Preprocessor.Cpphs.Tokenise ( Language/Preprocessor/Cpphs/Tokenise.hs, dist/build/Language/Preprocessor/Cpphs/Tokenise.o )
    Compiling Language.Preprocessor.Cpphs.MacroPass ( Language/Preprocessor/Cpphs/MacroPass.hs, dist/build/Language/Preprocessor/Cpphs/MacroPass.o )
    Compiling Language.Preprocessor.Cpphs.CppIfdef ( Language/Preprocessor/Cpphs/CppIfdef.hs, dist/build/Language/Preprocessor/Cpphs/CppIfdef.o )
    Compiling Language.Preprocessor.Cpphs.RunCpphs ( Language/Preprocessor/Cpphs/RunCpphs.hs, dist/build/Language/Preprocessor/Cpphs/RunCpphs.o )
    Compiling Language.Preprocessor.Cpphs ( Language/Preprocessor/Cpphs.hs, dist/build/Language/Preprocessor/Cpphs.o )
    Compiling Language.Preprocessor.Cpphs.HashDefine ( Language/Preprocessor/Cpphs/HashDefine.hs, dist/build/Language/Preprocessor/Cpphs/HashDefine.p_o )
    Compiling Text.ParserCombinators.HuttonMeijer ( Text/ParserCombinators/HuttonMeijer.hs, dist/build/Text/ParserCombinators/HuttonMeijer.p_o )
    Compiling Language.Preprocessor.Cpphs.SymTab ( Language/Preprocessor/Cpphs/SymTab.hs, dist/build/Language/Preprocessor/Cpphs/SymTab.p_o )
    Compiling Language.Preprocessor.Unlit ( Language/Preprocessor/Unlit.hs, dist/build/Language/Preprocessor/Unlit.p_o )
    Compiling Language.Preprocessor.Cpphs.Options ( Language/Preprocessor/Cpphs/Options.hs, dist/build/Language/Preprocessor/Cpphs/Options.p_o )
    Compiling Language.Preprocessor.Cpphs.Position ( Language/Preprocessor/Cpphs/Position.hs, dist/build/Language/Preprocessor/Cpphs/Position.p_o )
    Compiling Language.Preprocessor.Cpphs.ReadFirst ( Language/Preprocessor/Cpphs/ReadFirst.hs, dist/build/Language/Preprocessor/Cpphs/ReadFirst.p_o )
    Compiling Language.Preprocessor.Cpphs.Tokenise ( Language/Preprocessor/Cpphs/Tokenise.hs, dist/build/Language/Preprocessor/Cpphs/Tokenise.p_o )
    Compiling Language.Preprocessor.Cpphs.MacroPass ( Language/Preprocessor/Cpphs/MacroPass.hs, dist/build/Language/Preprocessor/Cpphs/MacroPass.p_o )
    Compiling Language.Preprocessor.Cpphs.CppIfdef ( Language/Preprocessor/Cpphs/CppIfdef.hs, dist/build/Language/Preprocessor/Cpphs/CppIfdef.p_o )
    Compiling Language.Preprocessor.Cpphs.RunCpphs ( Language/Preprocessor/Cpphs/RunCpphs.hs, dist/build/Language/Preprocessor/Cpphs/RunCpphs.p_o )
    Compiling Language.Preprocessor.Cpphs ( Language/Preprocessor/Cpphs.hs, dist/build/Language/Preprocessor/Cpphs.p_o )
    Registering cpphs-1.13.2…
    Compiling Text.ParserCombinators.HuttonMeijer ( Text/ParserCombinators/HuttonMeijer.hs, dist/build/cpphs/cpphs-tmp/Text/ParserCombinators/HuttonMeijer.o )
    Compiling Language.Preprocessor.Cpphs.SymTab ( Language/Preprocessor/Cpphs/SymTab.hs, dist/build/cpphs/cpphs-tmp/Language/Preprocessor/Cpphs/SymTab.o )
    Compiling Language.Preprocessor.Cpphs.Position ( Language/Preprocessor/Cpphs/Position.hs, dist/build/cpphs/cpphs-tmp/Language/Preprocessor/Cpphs/Position.o )
    Compiling Language.Preprocessor.Cpphs.ReadFirst ( Language/Preprocessor/Cpphs/ReadFirst.hs, dist/build/cpphs/cpphs-tmp/Language/Preprocessor/Cpphs/ReadFirst.o )
    Compiling Language.Preprocessor.Cpphs.Options ( Language/Preprocessor/Cpphs/Options.hs, dist/build/cpphs/cpphs-tmp/Language/Preprocessor/Cpphs/Options.o )
    Compiling Language.Preprocessor.Cpphs.HashDefine ( Language/Preprocessor/Cpphs/HashDefine.hs, dist/build/cpphs/cpphs-tmp/Language/Preprocessor/Cpphs/HashDefine.o )
    Compiling Language.Preprocessor.Cpphs.Tokenise ( Language/Preprocessor/Cpphs/Tokenise.hs, dist/build/cpphs/cpphs-tmp/Language/Preprocessor/Cpphs/Tokenise.o )
    Compiling Language.Preprocessor.Cpphs.MacroPass ( Language/Preprocessor/Cpphs/MacroPass.hs, dist/build/cpphs/cpphs-tmp/Language/Preprocessor/Cpphs/MacroPass.o )
    Compiling Language.Preprocessor.Cpphs.CppIfdef ( Language/Preprocessor/Cpphs/CppIfdef.hs, dist/build/cpphs/cpphs-tmp/Language/Preprocessor/Cpphs/CppIfdef.o )
    Compiling Language.Preprocessor.Unlit ( Language/Preprocessor/Unlit.hs, dist/build/cpphs/cpphs-tmp/Language/Preprocessor/Unlit.o )
    Compiling Language.Preprocessor.Cpphs.RunCpphs ( Language/Preprocessor/Cpphs/RunCpphs.hs, dist/build/cpphs/cpphs-tmp/Language/Preprocessor/Cpphs/RunCpphs.o )
    Compiling Language.Preprocessor.Cpphs ( Language/Preprocessor/Cpphs.hs, dist/build/cpphs/cpphs-tmp/Language/Preprocessor/Cpphs.o )
    Compiling Main             ( cpphs.hs, dist/build/cpphs/cpphs-tmp/Main.o )
    Linking dist/build/cpphs/cpphs …
    Running Haddock for cpphs-1.13.2…
    Preprocessing library cpphs-1.13.2…
    Preprocessing executables for cpphs-1.13.2…
    Warning: The documentation for the following packages are not installed. No
    links will be generated to these packages: ffi-1.0, rts-1.0
    haddock coverage for dist/build/tmp27529/Language/Preprocessor/Cpphs/HashDefine.hs:     4/5  80%
    haddock coverage for dist/build/tmp27529/Text/ParserCombinators/HuttonMeijer.hs:    2/36   6%
    haddock coverage for dist/build/tmp27529/Language/Preprocessor/Cpphs/SymTab.hs:     3/8  38%
    haddock coverage for dist/build/tmp27529/Language/Preprocessor/Unlit.hs:     2/2 100%
    haddock coverage for dist/build/tmp27529/Language/Preprocessor/Cpphs/Options.hs:     6/6 100%
    haddock coverage for dist/build/tmp27529/Language/Preprocessor/Cpphs/Position.hs:   14/14 100%
    haddock coverage for dist/build/tmp27529/Language/Preprocessor/Cpphs/ReadFirst.hs:     2/2 100%
    haddock coverage for dist/build/tmp27529/Language/Preprocessor/Cpphs/Tokenise.hs:     6/7  86%
    haddock coverage for dist/build/tmp27529/Language/Preprocessor/Cpphs/MacroPass.hs:     4/4 100%
    haddock coverage for dist/build/tmp27529/Language/Preprocessor/Cpphs/CppIfdef.hs:     2/2 100%
    haddock coverage for dist/build/tmp27529/Language/Preprocessor/Cpphs/RunCpphs.hs:     0/2   0%
    haddock coverage for dist/build/tmp27529/Language/Preprocessor/Cpphs.hs:   21/22  95%
    Documentation created: dist/doc/html/cpphs/index.html
    sudo: no tty present and no askpass program specified
    Configuring deepseq-1.3.0.0…
    Preprocessing library deepseq-1.3.0.0…
    Building deepseq-1.3.0.0…
    Compiling Control.DeepSeq  ( Control/DeepSeq.hs, dist/build/Control/DeepSeq.o )
    Compiling Control.DeepSeq  ( Control/DeepSeq.hs, dist/build/Control/DeepSeq.p_o )
    Registering deepseq-1.3.0.0…
    Running Haddock for deepseq-1.3.0.0…
    Preprocessing library deepseq-1.3.0.0…
    Warning: The documentation for the following packages are not installed. No
    links will be generated to these packages: ffi-1.0, rts-1.0
    haddock coverage for dist/build/tmp27529/Control/DeepSeq.hs:     5/5 100%
    Documentation created: dist/doc/html/deepseq/index.html
    sudo: no tty present and no askpass program specified
    Configuring dlist-0.5…
    Preprocessing library dlist-0.5…
    Building dlist-0.5…
    Compiling Data.DList       ( Data/DList.hs, dist/build/Data/DList.o )
    Compiling Data.DList       ( Data/DList.hs, dist/build/Data/DList.p_o )
    Registering dlist-0.5…
    Running Haddock for dlist-0.5…
    Preprocessing library dlist-0.5…
    Warning: The documentation for the following packages are not installed. No
    links will be generated to these packages: ffi-1.0, rts-1.0
    haddock coverage for dist/build/tmp27529/Data/DList.hs:   20/21  95%
    Documentation created: dist/doc/html/dlist/index.html
    sudo: no tty present and no askpass program specified
    Compiling Main             ( /var/folders/fm/f88n39gd3gz7ldvpn91zjyf80000gn/T/ghc-paths-0.1.0.827529/ghc-paths-0.1.0.8/Setup.hs, /var/folders/fm/f88n39gd3gz7ldvpn91zjyf80000gn/T/ghc-paths-0.1.0.827529/ghc-paths-0.1.0.8/dist/setup/Main.o )
    Linking /var/folders/fm/f88n39gd3gz7ldvpn91zjyf80000gn/T/ghc-paths-0.1.0.827529/ghc-paths-0.1.0.8/dist/setup/setup …
    Configuring ghc-paths-0.1.0.8…
    Building ghc-paths-0.1.0.8…
    Preprocessing library ghc-paths-0.1.0.8…
    Compiling GHC.Paths        ( GHC/Paths.hs, dist/build/GHC/Paths.o )
    Compiling GHC.Paths        ( GHC/Paths.hs, dist/build/GHC/Paths.p_o )
    Registering ghc-paths-0.1.0.8…
    Running Haddock for ghc-paths-0.1.0.8…
    Warning: The documentation for the following packages are not installed. No
    links will be generated to these packages: ffi-1.0, rts-1.0
    Preprocessing library ghc-paths-0.1.0.8…
    haddock coverage for dist/build/tmp-28467/GHC/Paths.hs:     0/2   0%
    Documentation created: dist/doc/html/ghc-paths/index.html
    sudo: no tty present and no askpass program specified
    Configuring primitive-0.4.1…
    Preprocessing library primitive-0.4.1…
    Building primitive-0.4.1…
    Compiling Data.Primitive.Internal.Compat ( Data/Primitive/Internal/Compat.hs, dist/build/Data/Primitive/Internal/Compat.o )
    Compiling Data.Primitive.MachDeps ( Data/Primitive/MachDeps.hs, dist/build/Data/Primitive/MachDeps.o )
    Compiling Control.Monad.Primitive ( Control/Monad/Primitive.hs, dist/build/Control/Monad/Primitive.o )
    Compiling Data.Primitive.Types ( Data/Primitive/Types.hs, dist/build/Data/Primitive/Types.o )
    Compiling Data.Primitive.Array ( Data/Primitive/Array.hs, dist/build/Data/Primitive/Array.o )
    Compiling Data.Primitive.ByteArray ( Data/Primitive/ByteArray.hs, dist/build/Data/Primitive/ByteArray.o )
    Compiling Data.Primitive.Addr ( Data/Primitive/Addr.hs, dist/build/Data/Primitive/Addr.o )
    Compiling Data.Primitive   ( Data/Primitive.hs, dist/build/Data/Primitive.o )
    Compiling Data.Primitive.MutVar ( Data/Primitive/MutVar.hs, dist/build/Data/Primitive/MutVar.o )
    Compiling Data.Primitive.Internal.Compat ( Data/Primitive/Internal/Compat.hs, dist/build/Data/Primitive/Internal/Compat.p_o )
    Compiling Data.Primitive.MachDeps ( Data/Primitive/MachDeps.hs, dist/build/Data/Primitive/MachDeps.p_o )
    Compiling Control.Monad.Primitive ( Control/Monad/Primitive.hs, dist/build/Control/Monad/Primitive.p_o )
    Compiling Data.Primitive.Types ( Data/Primitive/Types.hs, dist/build/Data/Primitive/Types.p_o )
    Compiling Data.Primitive.Array ( Data/Primitive/Array.hs, dist/build/Data/Primitive/Array.p_o )
    Compiling Data.Primitive.ByteArray ( Data/Primitive/ByteArray.hs, dist/build/Data/Primitive/ByteArray.p_o )
    Compiling Data.Primitive.Addr ( Data/Primitive/Addr.hs, dist/build/Data/Primitive/Addr.p_o )
    Compiling Data.Primitive   ( Data/Primitive.hs, dist/build/Data/Primitive.p_o )
    Compiling Data.Primitive.MutVar ( Data/Primitive/MutVar.hs, dist/build/Data/Primitive/MutVar.p_o )
    Registering primitive-0.4.1…
    Running Haddock for primitive-0.4.1…
    Preprocessing library primitive-0.4.1…
    Warning: The documentation for the following packages are not installed. No
    links will be generated to these packages: ffi-1.0, rts-1.0
    haddock coverage for dist/build/tmp27529/Data/Primitive/Internal/Compat.hs:     1/2  50%
    haddock coverage for dist/build/tmp27529/Data/Primitive/MachDeps.hs:     1/2  50%
    Warning: Control.Monad.Primitive: We do not support associated types in instances yet. These instances are affected:
    Control.Monad.Primitive.PrimMonad GHC.Types.IO, Control.Monad.Primitive.PrimMonad (GHC.ST.ST s)
    haddock coverage for dist/build/tmp27529/Control/Monad/Primitive.hs:   10/14  71%
    haddock coverage for dist/build/tmp27529/Data/Primitive/Types.hs:     3/3 100%
    haddock coverage for dist/build/tmp27529/Data/Primitive/Array.hs:   13/13 100%
    haddock coverage for dist/build/tmp27529/Data/Primitive/ByteArray.hs:   21/27  78%
    haddock coverage for dist/build/tmp27529/Data/Primitive/Addr.hs:   11/12  92%
    haddock coverage for dist/build/tmp27529/Data/Primitive.hs:     7/7 100%
    haddock coverage for dist/build/tmp27529/Data/Primitive/MutVar.hs:     6/6 100%
    Documentation created: dist/doc/html/primitive/index.html
    sudo: no tty present and no askpass program specified
    Configuring random-1.0.1.1…
    Preprocessing library random-1.0.1.1…
    Building random-1.0.1.1…
    Compiling System.Random    ( System/Random.hs, dist/build/System/Random.o )
    Compiling System.Random    ( System/Random.hs, dist/build/System/Random.p_o )
    Registering random-1.0.1.1…
    Running Haddock for random-1.0.1.1…
    Preprocessing library random-1.0.1.1…
    Warning: The documentation for the following packages are not installed. No
    links will be generated to these packages: ffi-1.0, rts-1.0
    Cannot find documentation for: $intro
    haddock coverage for dist/build/tmp27529/System/Random.hs:   16/16 100%
    Documentation created: dist/doc/html/random/index.html
    sudo: no tty present and no askpass program specified
    Downloading stm-2.2.0.1…
    Configuring stm-2.2.0.1…
    Preprocessing library stm-2.2.0.1…
    Building stm-2.2.0.1…
    Compiling Control.Sequential.STM ( Control/Sequential/STM.hs, dist/build/Control/Sequential/STM.o )
    Compiling Control.Concurrent.STM.TChan ( Control/Concurrent/STM/TChan.hs, dist/build/Control/Concurrent/STM/TChan.o )
    Compiling Control.Concurrent.STM.TMVar ( Control/Concurrent/STM/TMVar.hs, dist/build/Control/Concurrent/STM/TMVar.o )
    Compiling Control.Concurrent.STM.TVar ( Control/Concurrent/STM/TVar.hs, dist/build/Control/Concurrent/STM/TVar.o )
    Compiling Control.Concurrent.STM.TArray ( Control/Concurrent/STM/TArray.hs, dist/build/Control/Concurrent/STM/TArray.o )
    Compiling Control.Monad.STM ( Control/Monad/STM.hs, dist/build/Control/Monad/STM.o )
    Compiling Control.Concurrent.STM ( Control/Concurrent/STM.hs, dist/build/Control/Concurrent/STM.o )
    Compiling Control.Sequential.STM ( Control/Sequential/STM.hs, dist/build/Control/Sequential/STM.p_o )
    Compiling Control.Concurrent.STM.TChan ( Control/Concurrent/STM/TChan.hs, dist/build/Control/Concurrent/STM/TChan.p_o )
    Compiling Control.Concurrent.STM.TMVar ( Control/Concurrent/STM/TMVar.hs, dist/build/Control/Concurrent/STM/TMVar.p_o )
    Compiling Control.Concurrent.STM.TVar ( Control/Concurrent/STM/TVar.hs, dist/build/Control/Concurrent/STM/TVar.p_o )
    Compiling Control.Concurrent.STM.TArray ( Control/Concurrent/STM/TArray.hs, dist/build/Control/Concurrent/STM/TArray.p_o )
    Compiling Control.Monad.STM ( Control/Monad/STM.hs, dist/build/Control/Monad/STM.p_o )
    Compiling Control.Concurrent.STM ( Control/Concurrent/STM.hs, dist/build/Control/Concurrent/STM.p_o )
    Registering stm-2.2.0.1…
    Running Haddock for stm-2.2.0.1…
    Preprocessing library stm-2.2.0.1…
    Warning: The documentation for the following packages are not installed. No
    links will be generated to these packages: ffi-1.0, rts-1.0
    haddock coverage for dist/build/tmp27529/Control/Sequential/STM.hs:    0/11   0%
    haddock coverage for dist/build/tmp27529/Control/Concurrent/STM/TChan.hs:   10/10 100%
    haddock coverage for dist/build/tmp27529/Control/Concurrent/STM/TMVar.hs:   14/14 100%
    haddock coverage for dist/build/tmp27529/Control/Concurrent/STM/TVar.hs:     9/9 100%
    haddock coverage for dist/build/tmp27529/Control/Concurrent/STM/TArray.hs:     2/2 100%
    haddock coverage for dist/build/tmp27529/Control/Monad/STM.hs:    9/10  90%
    haddock coverage for dist/build/tmp27529/Control/Concurrent/STM.hs:     6/6 100%
    Documentation created: dist/doc/html/stm/index.html
    sudo: no tty present and no askpass program specified
    Compiling Main             ( /var/folders/fm/f88n39gd3gz7ldvpn91zjyf80000gn/T/syb-0.3.627529/syb-0.3.6/Setup.hs, /var/folders/fm/f88n39gd3gz7ldvpn91zjyf80000gn/T/syb-0.3.627529/syb-0.3.6/dist/setup/Main.o )

    /var/folders/fm/f88n39gd3gz7ldvpn91zjyf80000gn/T/syb-0.3.627529/syb-0.3.6/Setup.hs:4:30:
        Warning: In the use of `runTests'
                 (imported from Distribution.Simple, but defined in Distribution.Simple.UserHooks):
                 Deprecated: "Please use the new testing interface instead!"
    Linking /var/folders/fm/f88n39gd3gz7ldvpn91zjyf80000gn/T/syb-0.3.627529/syb-0.3.6/dist/setup/setup …
    Configuring syb-0.3.6…
    Building syb-0.3.6…
    Preprocessing library syb-0.3.6…
    Compiling Data.Generics.Basics ( src/Data/Generics/Basics.hs, dist/build/Data/Generics/Basics.o )
    Compiling Generics.SYB.Basics ( src/Generics/SYB/Basics.hs, dist/build/Generics/SYB/Basics.o )
    Compiling Data.Generics.Instances ( src/Data/Generics/Instances.hs, dist/build/Data/Generics/Instances.o )
    Compiling Generics.SYB.Instances ( src/Generics/SYB/Instances.hs, dist/build/Generics/SYB/Instances.o )
    Compiling Data.Generics.Aliases ( src/Data/Generics/Aliases.hs, dist/build/Data/Generics/Aliases.o )
    Compiling Data.Generics.Schemes ( src/Data/Generics/Schemes.hs, dist/build/Data/Generics/Schemes.o )
    Compiling Generics.SYB.Schemes ( src/Generics/SYB/Schemes.hs, dist/build/Generics/SYB/Schemes.o )
    Compiling Data.Generics.Text ( src/Data/Generics/Text.hs, dist/build/Data/Generics/Text.o )
    Compiling Generics.SYB.Text ( src/Generics/SYB/Text.hs, dist/build/Generics/SYB/Text.o )
    Compiling Data.Generics.Twins ( src/Data/Generics/Twins.hs, dist/build/Data/Generics/Twins.o )
    Compiling Generics.SYB.Twins ( src/Generics/SYB/Twins.hs, dist/build/Generics/SYB/Twins.o )
    Compiling Data.Generics.Builders ( src/Data/Generics/Builders.hs, dist/build/Data/Generics/Builders.o )
    Compiling Generics.SYB.Builders ( src/Generics/SYB/Builders.hs, dist/build/Generics/SYB/Builders.o )
    Compiling Generics.SYB.Aliases ( src/Generics/SYB/Aliases.hs, dist/build/Generics/SYB/Aliases.o )
    Compiling Data.Generics    ( src/Data/Generics.hs, dist/build/Data/Generics.o )
    Compiling Generics.SYB     ( src/Generics/SYB.hs, dist/build/Generics/SYB.o )
    Compiling Data.Generics.Basics ( src/Data/Generics/Basics.hs, dist/build/Data/Generics/Basics.p_o )
    Compiling Generics.SYB.Basics ( src/Generics/SYB/Basics.hs, dist/build/Generics/SYB/Basics.p_o )
    Compiling Data.Generics.Instances ( src/Data/Generics/Instances.hs, dist/build/Data/Generics/Instances.p_o )
    Compiling Generics.SYB.Instances ( src/Generics/SYB/Instances.hs, dist/build/Generics/SYB/Instances.p_o )
    Compiling Data.Generics.Aliases ( src/Data/Generics/Aliases.hs, dist/build/Data/Generics/Aliases.p_o )
    Compiling Data.Generics.Schemes ( src/Data/Generics/Schemes.hs, dist/build/Data/Generics/Schemes.p_o )
    Compiling Generics.SYB.Schemes ( src/Generics/SYB/Schemes.hs, dist/build/Generics/SYB/Schemes.p_o )
    Compiling Data.Generics.Text ( src/Data/Generics/Text.hs, dist/build/Data/Generics/Text.p_o )
    Compiling Generics.SYB.Text ( src/Generics/SYB/Text.hs, dist/build/Generics/SYB/Text.p_o )
    Compiling Data.Generics.Twins ( src/Data/Generics/Twins.hs, dist/build/Data/Generics/Twins.p_o )
    Compiling Generics.SYB.Twins ( src/Generics/SYB/Twins.hs, dist/build/Generics/SYB/Twins.p_o )
    Compiling Data.Generics.Builders ( src/Data/Generics/Builders.hs, dist/build/Data/Generics/Builders.p_o )
    Compiling Generics.SYB.Builders ( src/Generics/SYB/Builders.hs, dist/build/Generics/SYB/Builders.p_o )
    Compiling Generics.SYB.Aliases ( src/Generics/SYB/Aliases.hs, dist/build/Generics/SYB/Aliases.p_o )
    Compiling Data.Generics    ( src/Data/Generics.hs, dist/build/Data/Generics.p_o )
    Compiling Generics.SYB     ( src/Generics/SYB.hs, dist/build/Generics/SYB.p_o )
    Registering syb-0.3.6…
    Running Haddock for syb-0.3.6…
    Warning: The documentation for the following packages are not installed. No
    links will be generated to these packages: ffi-1.0, rts-1.0
    Preprocessing library syb-0.3.6…
    haddock coverage for dist/build/tmp-29719/src/Data/Generics/Basics.hs:     2/2 100%
    haddock coverage for dist/build/tmp-29719/src/Generics/SYB/Basics.hs:     2/2 100%
    haddock coverage for dist/build/tmp-29719/src/Data/Generics/Instances.hs:     1/1 100%
    haddock coverage for dist/build/tmp-29719/src/Generics/SYB/Instances.hs:     1/1 100%
    haddock coverage for dist/build/tmp-29719/src/Data/Generics/Aliases.hs:   43/45  96%
    haddock coverage for dist/build/tmp-29719/src/Data/Generics/Schemes.hs:   18/18 100%
    haddock coverage for dist/build/tmp-29719/src/Generics/SYB/Schemes.hs:     2/2 100%
    haddock coverage for dist/build/tmp-29719/src/Data/Generics/Text.hs:     6/6 100%
    haddock coverage for dist/build/tmp-29719/src/Generics/SYB/Text.hs:     2/2 100%
    haddock coverage for dist/build/tmp-29719/src/Data/Generics/Twins.hs:   16/16 100%
    haddock coverage for dist/build/tmp-29719/src/Generics/SYB/Twins.hs:     2/2 100%
    haddock coverage for dist/build/tmp-29719/src/Data/Generics/Builders.hs:     3/3 100%
    haddock coverage for dist/build/tmp-29719/src/Generics/SYB/Builders.hs:     2/2 100%
    haddock coverage for dist/build/tmp-29719/src/Generics/SYB/Aliases.hs:     2/2 100%
    haddock coverage for dist/build/tmp-29719/src/Data/Generics.hs:     8/8 100%
    haddock coverage for dist/build/tmp-29719/src/Generics/SYB.hs:     2/2 100%
    Documentation created: dist/doc/html/syb/index.html
    sudo: no tty present and no askpass program specified
    Downloading tar-0.3.2.0…
    Configuring tar-0.3.2.0…
    Preprocessing library tar-0.3.2.0…
    Building tar-0.3.2.0…
    Compiling Codec.Archive.Tar.Types ( Codec/Archive/Tar/Types.hs, dist/build/Codec/Archive/Tar/Types.o )
    Compiling Codec.Archive.Tar.Read ( Codec/Archive/Tar/Read.hs, dist/build/Codec/Archive/Tar/Read.o )
    Compiling Codec.Archive.Tar.Write ( Codec/Archive/Tar/Write.hs, dist/build/Codec/Archive/Tar/Write.o )
    Compiling Codec.Archive.Tar.Pack ( Codec/Archive/Tar/Pack.hs, dist/build/Codec/Archive/Tar/Pack.o )
    Compiling Codec.Archive.Tar.Check ( Codec/Archive/Tar/Check.hs, dist/build/Codec/Archive/Tar/Check.o )
    Compiling Codec.Archive.Tar.Unpack ( Codec/Archive/Tar/Unpack.hs, dist/build/Codec/Archive/Tar/Unpack.o )
    Compiling Codec.Archive.Tar.Entry ( Codec/Archive/Tar/Entry.hs, dist/build/Codec/Archive/Tar/Entry.o )
    Compiling Codec.Archive.Tar ( Codec/Archive/Tar.hs, dist/build/Codec/Archive/Tar.o )
    Compiling Codec.Archive.Tar.Types ( Codec/Archive/Tar/Types.hs, dist/build/Codec/Archive/Tar/Types.p_o )
    Compiling Codec.Archive.Tar.Read ( Codec/Archive/Tar/Read.hs, dist/build/Codec/Archive/Tar/Read.p_o )
    Compiling Codec.Archive.Tar.Write ( Codec/Archive/Tar/Write.hs, dist/build/Codec/Archive/Tar/Write.p_o )
    Compiling Codec.Archive.Tar.Pack ( Codec/Archive/Tar/Pack.hs, dist/build/Codec/Archive/Tar/Pack.p_o )
    Compiling Codec.Archive.Tar.Check ( Codec/Archive/Tar/Check.hs, dist/build/Codec/Archive/Tar/Check.p_o )
    Compiling Codec.Archive.Tar.Unpack ( Codec/Archive/Tar/Unpack.hs, dist/build/Codec/Archive/Tar/Unpack.p_o )
    Compiling Codec.Archive.Tar.Entry ( Codec/Archive/Tar/Entry.hs, dist/build/Codec/Archive/Tar/Entry.p_o )
    Compiling Codec.Archive.Tar ( Codec/Archive/Tar.hs, dist/build/Codec/Archive/Tar.p_o )
    Registering tar-0.3.2.0…
    Running Haddock for tar-0.3.2.0…
    Preprocessing library tar-0.3.2.0…
    Warning: The documentation for the following packages are not installed. No
    links will be generated to these packages: ffi-1.0, rts-1.0
    haddock coverage for dist/build/tmp27529/Codec/Archive/Tar/Types.hs:   26/32  81%
    haddock coverage for dist/build/tmp27529/Codec/Archive/Tar/Read.hs:     2/2 100%
    haddock coverage for dist/build/tmp27529/Codec/Archive/Tar/Write.hs:     2/2 100%
    haddock coverage for dist/build/tmp27529/Codec/Archive/Tar/Pack.hs:     5/5 100%
    haddock coverage for dist/build/tmp27529/Codec/Archive/Tar/Check.hs:     2/4  50%
    haddock coverage for dist/build/tmp27529/Codec/Archive/Tar/Unpack.hs:     2/2 100%
    haddock coverage for dist/build/tmp27529/Codec/Archive/Tar/Entry.hs:   32/38  84%
    haddock coverage for dist/build/tmp27529/Codec/Archive/Tar.hs:   32/32 100%
    Documentation created: dist/doc/html/tar/index.html
    sudo: no tty present and no askpass program specified
    Downloading terminfo-0.3.2.3…
    Configuring terminfo-0.3.2.3…
    checking for gcc… gcc
    checking for C compiler default output file name… a.out
    checking whether the C compiler works… yes
    checking whether we are cross compiling… no
    checking for suffix of executables…
    checking for suffix of object files… o
    checking whether we are using the GNU C compiler… yes
    checking whether gcc accepts -g… yes
    checking for gcc option to accept ISO C89… none needed
    checking how to run the C preprocessor… gcc -E
    checking for grep that handles long lines and -e… /usr/bin/grep
    checking for egrep… /usr/bin/grep -E
    checking for ANSI C header files… yes
    checking for sys/types.h… yes
    checking for sys/stat.h… yes
    checking for stdlib.h… yes
    checking for string.h… yes
    checking for memory.h… yes
    checking for strings.h… yes
    checking for inttypes.h… yes
    checking for stdint.h… yes
    checking for unistd.h… yes
    checking ncurses.h usability… yes
    checking ncurses.h presence… yes
    checking for ncurses.h… yes
    checking for setupterm in -lncursesw… no
    checking for setupterm in -lncurses… yes
    configure: creating ./config.status
    config.status: creating terminfo.buildinfo
    Preprocessing library terminfo-0.3.2.3…
    Building terminfo-0.3.2.3…
    Compiling System.Console.Terminfo.Base ( System/Console/Terminfo/Base.hs, dist/build/System/Console/Terminfo/Base.o )
    Compiling System.Console.Terminfo.Keys ( System/Console/Terminfo/Keys.hs, dist/build/System/Console/Terminfo/Keys.o )
    Compiling System.Console.Terminfo.Cursor ( System/Console/Terminfo/Cursor.hs, dist/build/System/Console/Terminfo/Cursor.o )
    Compiling System.Console.Terminfo.Effects ( System/Console/Terminfo/Effects.hs, dist/build/System/Console/Terminfo/Effects.o )
    Compiling System.Console.Terminfo.Edit ( System/Console/Terminfo/Edit.hs, dist/build/System/Console/Terminfo/Edit.o )
    Compiling System.Console.Terminfo.Color ( System/Console/Terminfo/Color.hs, dist/build/System/Console/Terminfo/Color.o )
    Compiling System.Console.Terminfo ( System/Console/Terminfo.hs, dist/build/System/Console/Terminfo.o )
    Compiling System.Console.Terminfo.Base ( System/Console/Terminfo/Base.hs, dist/build/System/Console/Terminfo/Base.p_o )
    Compiling System.Console.Terminfo.Keys ( System/Console/Terminfo/Keys.hs, dist/build/System/Console/Terminfo/Keys.p_o )
    Compiling System.Console.Terminfo.Cursor ( System/Console/Terminfo/Cursor.hs, dist/build/System/Console/Terminfo/Cursor.p_o )
    Compiling System.Console.Terminfo.Effects ( System/Console/Terminfo/Effects.hs, dist/build/System/Console/Terminfo/Effects.p_o )
    Compiling System.Console.Terminfo.Edit ( System/Console/Terminfo/Edit.hs, dist/build/System/Console/Terminfo/Edit.p_o )
    Compiling System.Console.Terminfo.Color ( System/Console/Terminfo/Color.hs, dist/build/System/Console/Terminfo/Color.p_o )
    Compiling System.Console.Terminfo ( System/Console/Terminfo.hs, dist/build/System/Console/Terminfo.p_o )
    Registering terminfo-0.3.2.3…
    Running Haddock for terminfo-0.3.2.3…
    Preprocessing library terminfo-0.3.2.3…
    Warning: The documentation for the following packages are not installed. No
    links will be generated to these packages: ffi-1.0, rts-1.0
    haddock coverage for dist/build/tmp27529/System/Console/Terminfo/Base.hs:   22/28  79%
    haddock coverage for dist/build/tmp27529/System/Console/Terminfo/Keys.hs:    6/19  32%
    haddock coverage for dist/build/tmp27529/System/Console/Terminfo/Cursor.hs:   15/37  41%
    haddock coverage for dist/build/tmp27529/System/Console/Terminfo/Effects.hs:   14/25  56%
    haddock coverage for dist/build/tmp27529/System/Console/Terminfo/Edit.hs:     5/5 100%
    haddock coverage for dist/build/tmp27529/System/Console/Terminfo/Color.hs:     7/8  88%
    haddock coverage for dist/build/tmp27529/System/Console/Terminfo.hs:     7/7 100%
    Documentation created: dist/doc/html/terminfo/index.html
    sudo: no tty present and no askpass program specified
    Configuring transformers-0.2.2.0…
    Preprocessing library transformers-0.2.2.0…
    Building transformers-0.2.2.0…
    Compiling Data.Functor.Product ( Data/Functor/Product.hs, dist/build/Data/Functor/Product.o )
    Compiling Data.Functor.Constant ( Data/Functor/Constant.hs, dist/build/Data/Functor/Constant.o )
    Compiling Data.Functor.Compose ( Data/Functor/Compose.hs, dist/build/Data/Functor/Compose.o )
    Compiling Data.Functor.Identity ( Data/Functor/Identity.hs, dist/build/Data/Functor/Identity.o )
    Compiling Control.Monad.Trans.Class ( Control/Monad/Trans/Class.hs, dist/build/Control/Monad/Trans/Class.o )
    Compiling Control.Monad.IO.Class ( Control/Monad/IO/Class.hs, dist/build/Control/Monad/IO/Class.o )
    Compiling Control.Monad.Trans.Cont ( Control/Monad/Trans/Cont.hs, dist/build/Control/Monad/Trans/Cont.o )
    Compiling Control.Monad.Trans.Error ( Control/Monad/Trans/Error.hs, dist/build/Control/Monad/Trans/Error.o )

    Implicit import declaration:
        Warning: In the use of `catch'
                 (imported from Prelude, but defined in System.IO.Error):
                 Deprecated: "Please use the new exceptions variant, Control.Exception.catch"
    Compiling Control.Monad.Trans.Identity ( Control/Monad/Trans/Identity.hs, dist/build/Control/Monad/Trans/Identity.o )
    Compiling Control.Monad.Trans.List ( Control/Monad/Trans/List.hs, dist/build/Control/Monad/Trans/List.o )
    Compiling Control.Monad.Trans.Maybe ( Control/Monad/Trans/Maybe.hs, dist/build/Control/Monad/Trans/Maybe.o )
    Compiling Control.Monad.Trans.Reader ( Control/Monad/Trans/Reader.hs, dist/build/Control/Monad/Trans/Reader.o )
    Compiling Control.Monad.Trans.RWS.Lazy ( Control/Monad/Trans/RWS/Lazy.hs, dist/build/Control/Monad/Trans/RWS/Lazy.o )
    Compiling Control.Monad.Trans.RWS ( Control/Monad/Trans/RWS.hs, dist/build/Control/Monad/Trans/RWS.o )
    Compiling Control.Monad.Trans.RWS.Strict ( Control/Monad/Trans/RWS/Strict.hs, dist/build/Control/Monad/Trans/RWS/Strict.o )
    Compiling Control.Monad.Trans.State.Lazy ( Control/Monad/Trans/State/Lazy.hs, dist/build/Control/Monad/Trans/State/Lazy.o )
    Compiling Control.Monad.Trans.State ( Control/Monad/Trans/State.hs, dist/build/Control/Monad/Trans/State.o )
    Compiling Control.Monad.Trans.State.Strict ( Control/Monad/Trans/State/Strict.hs, dist/build/Control/Monad/Trans/State/Strict.o )
    Compiling Control.Monad.Trans.Writer.Lazy ( Control/Monad/Trans/Writer/Lazy.hs, dist/build/Control/Monad/Trans/Writer/Lazy.o )
    Compiling Control.Monad.Trans.Writer ( Control/Monad/Trans/Writer.hs, dist/build/Control/Monad/Trans/Writer.o )
    Compiling Control.Monad.Trans.Writer.Strict ( Control/Monad/Trans/Writer/Strict.hs, dist/build/Control/Monad/Trans/Writer/Strict.o )
    Compiling Data.Functor.Product ( Data/Functor/Product.hs, dist/build/Data/Functor/Product.p_o )
    Compiling Data.Functor.Constant ( Data/Functor/Constant.hs, dist/build/Data/Functor/Constant.p_o )
    Compiling Data.Functor.Compose ( Data/Functor/Compose.hs, dist/build/Data/Functor/Compose.p_o )
    Compiling Data.Functor.Identity ( Data/Functor/Identity.hs, dist/build/Data/Functor/Identity.p_o )
    Compiling Control.Monad.Trans.Class ( Control/Monad/Trans/Class.hs, dist/build/Control/Monad/Trans/Class.p_o )
    Compiling Control.Monad.IO.Class ( Control/Monad/IO/Class.hs, dist/build/Control/Monad/IO/Class.p_o )
    Compiling Control.Monad.Trans.Cont ( Control/Monad/Trans/Cont.hs, dist/build/Control/Monad/Trans/Cont.p_o )
    Compiling Control.Monad.Trans.Error ( Control/Monad/Trans/Error.hs, dist/build/Control/Monad/Trans/Error.p_o )

    Implicit import declaration:
        Warning: In the use of `catch'
                 (imported from Prelude, but defined in System.IO.Error):
                 Deprecated: "Please use the new exceptions variant, Control.Exception.catch"
    Compiling Control.Monad.Trans.Identity ( Control/Monad/Trans/Identity.hs, dist/build/Control/Monad/Trans/Identity.p_o )
    Compiling Control.Monad.Trans.List ( Control/Monad/Trans/List.hs, dist/build/Control/Monad/Trans/List.p_o )
    Compiling Control.Monad.Trans.Maybe ( Control/Monad/Trans/Maybe.hs, dist/build/Control/Monad/Trans/Maybe.p_o )
    Compiling Control.Monad.Trans.Reader ( Control/Monad/Trans/Reader.hs, dist/build/Control/Monad/Trans/Reader.p_o )
    Compiling Control.Monad.Trans.RWS.Lazy ( Control/Monad/Trans/RWS/Lazy.hs, dist/build/Control/Monad/Trans/RWS/Lazy.p_o )
    Compiling Control.Monad.Trans.RWS ( Control/Monad/Trans/RWS.hs, dist/build/Control/Monad/Trans/RWS.p_o )
    Compiling Control.Monad.Trans.RWS.Strict ( Control/Monad/Trans/RWS/Strict.hs, dist/build/Control/Monad/Trans/RWS/Strict.p_o )
    Compiling Control.Monad.Trans.State.Lazy ( Control/Monad/Trans/State/Lazy.hs, dist/build/Control/Monad/Trans/State/Lazy.p_o )
    Compiling Control.Monad.Trans.State ( Control/Monad/Trans/State.hs, dist/build/Control/Monad/Trans/State.p_o )
    Compiling Control.Monad.Trans.State.Strict ( Control/Monad/Trans/State/Strict.hs, dist/build/Control/Monad/Trans/State/Strict.p_o )
    Compiling Control.Monad.Trans.Writer.Lazy ( Control/Monad/Trans/Writer/Lazy.hs, dist/build/Control/Monad/Trans/Writer/Lazy.p_o )
    Compiling Control.Monad.Trans.Writer ( Control/Monad/Trans/Writer.hs, dist/build/Control/Monad/Trans/Writer.p_o )
    Compiling Control.Monad.Trans.Writer.Strict ( Control/Monad/Trans/Writer/Strict.hs, dist/build/Control/Monad/Trans/Writer/Strict.p_o )
    Registering transformers-0.2.2.0…
    Running Haddock for transformers-0.2.2.0…
    Preprocessing library transformers-0.2.2.0…
    Warning: The documentation for the following packages are not installed. No
    links will be generated to these packages: ffi-1.0, rts-1.0

    Implicit import declaration:
        Warning: In the use of `catch'
                 (imported from Prelude, but defined in System.IO.Error):
                 Deprecated: "Please use the new exceptions variant, Control.Exception.catch"
    haddock coverage for dist/build/tmp27529/Data/Functor/Product.hs:     2/2 100%
    haddock coverage for dist/build/tmp27529/Data/Functor/Constant.hs:     2/2 100%
    haddock coverage for dist/build/tmp27529/Data/Functor/Compose.hs:     2/2 100%
    haddock coverage for dist/build/tmp27529/Data/Functor/Identity.hs:     2/2 100%
    haddock coverage for dist/build/tmp27529/Control/Monad/Trans/Class.hs:     8/8 100%
    haddock coverage for dist/build/tmp27529/Control/Monad/IO/Class.hs:     2/2 100%
    haddock coverage for dist/build/tmp27529/Control/Monad/Trans/Cont.hs:   10/14  71%
    haddock coverage for dist/build/tmp27529/Control/Monad/Trans/Error.hs:   15/15 100%
    haddock coverage for dist/build/tmp27529/Control/Monad/Trans/Identity.hs:     7/7 100%
    haddock coverage for dist/build/tmp27529/Control/Monad/Trans/List.hs:     7/7 100%
    haddock coverage for dist/build/tmp27529/Control/Monad/Trans/Maybe.hs:     9/9 100%
    haddock coverage for dist/build/tmp27529/Control/Monad/Trans/Reader.hs:   18/18 100%
    haddock coverage for dist/build/tmp27529/Control/Monad/Trans/RWS/Lazy.hs:   26/34  76%
    haddock coverage for dist/build/tmp27529/Control/Monad/Trans/RWS.hs:     2/2 100%
    haddock coverage for dist/build/tmp27529/Control/Monad/Trans/RWS/Strict.hs:   26/34  76%
    haddock coverage for dist/build/tmp27529/Control/Monad/Trans/State/Lazy.hs:   33/33 100%
    haddock coverage for dist/build/tmp27529/Control/Monad/Trans/State.hs:     2/2 100%
    haddock coverage for dist/build/tmp27529/Control/Monad/Trans/State/Strict.hs:   33/33 100%
    haddock coverage for dist/build/tmp27529/Control/Monad/Trans/Writer/Lazy.hs:   20/20 100%
    haddock coverage for dist/build/tmp27529/Control/Monad/Trans/Writer.hs:     2/2 100%
    haddock coverage for dist/build/tmp27529/Control/Monad/Trans/Writer/Strict.hs:   20/20 100%
    Documentation created: dist/doc/html/transformers/index.html
    sudo: no tty present and no askpass program specified
    Configuring utf8-string-0.3.7…
    Preprocessing library utf8-string-0.3.7…
    Building utf8-string-0.3.7…
    Compiling Codec.Binary.UTF8.String ( Codec/Binary/UTF8/String.hs, dist/build/Codec/Binary/UTF8/String.o )
    Compiling Codec.Binary.UTF8.Generic ( Codec/Binary/UTF8/Generic.hs, dist/build/Codec/Binary/UTF8/Generic.o )
    Compiling Data.String.UTF8 ( Data/String/UTF8.hs, dist/build/Data/String/UTF8.o )
    Compiling System.IO.UTF8   ( System/IO/UTF8.hs, dist/build/System/IO/UTF8.o )
    Compiling System.Environment.UTF8 ( System/Environment/UTF8.hs, dist/build/System/Environment/UTF8.o )
    Compiling Data.ByteString.UTF8 ( Data/ByteString/UTF8.hs, dist/build/Data/ByteString/UTF8.o )
    Compiling Data.ByteString.Lazy.UTF8 ( Data/ByteString/Lazy/UTF8.hs, dist/build/Data/ByteString/Lazy/UTF8.o )
    Compiling Codec.Binary.UTF8.String ( Codec/Binary/UTF8/String.hs, dist/build/Codec/Binary/UTF8/String.p_o )
    Compiling Codec.Binary.UTF8.Generic ( Codec/Binary/UTF8/Generic.hs, dist/build/Codec/Binary/UTF8/Generic.p_o )
    Compiling Data.String.UTF8 ( Data/String/UTF8.hs, dist/build/Data/String/UTF8.p_o )
    Compiling System.IO.UTF8   ( System/IO/UTF8.hs, dist/build/System/IO/UTF8.p_o )
    Compiling System.Environment.UTF8 ( System/Environment/UTF8.hs, dist/build/System/Environment/UTF8.p_o )
    Compiling Data.ByteString.UTF8 ( Data/ByteString/UTF8.hs, dist/build/Data/ByteString/UTF8.p_o )
    Compiling Data.ByteString.Lazy.UTF8 ( Data/ByteString/Lazy/UTF8.hs, dist/build/Data/ByteString/Lazy/UTF8.p_o )
    Registering utf8-string-0.3.7…
    Running Haddock for utf8-string-0.3.7…
    Preprocessing library utf8-string-0.3.7…
    Warning: The documentation for the following packages are not installed. No
    links will be generated to these packages: ffi-1.0, rts-1.0
    haddock coverage for dist/build/tmp27529/Codec/Binary/UTF8/String.hs:     8/8 100%
    haddock coverage for dist/build/tmp27529/Codec/Binary/UTF8/Generic.hs:   16/17  94%
    haddock coverage for dist/build/tmp27529/Data/String/UTF8.hs:   24/27  89%
    haddock coverage for dist/build/tmp27529/System/IO/UTF8.hs:   14/17  82%
    haddock coverage for dist/build/tmp27529/System/Environment/UTF8.hs:     1/7  14%
    haddock coverage for dist/build/tmp27529/Data/ByteString/UTF8.hs:   17/17 100%
    haddock coverage for dist/build/tmp27529/Data/ByteString/Lazy/UTF8.hs:   17/17 100%
    Documentation created: dist/doc/html/utf8-string/index.html
    sudo: no tty present and no askpass program specified
    Downloading zlib-0.5.3.2…
    Configuring zlib-0.5.3.2…
    Preprocessing library zlib-0.5.3.2…
    Stream.hsc:86:21: error: missing binary operator before token "("
    Stream.hsc:86:21: error: missing binary operator before token "("
    Stream.hsc:86:21: error: missing binary operator before token "("
    compiling dist/build/Codec/Compression/Zlib/Stream_hsc_make.c failed (exit code 1)
    command was: /usr/bin/gcc -c dist/build/Codec/Compression/Zlib/Stream_hsc_make.c -o dist/build/Codec/Compression/Zlib/Stream_hsc_make.o -m64 -fno-stack-protector -m64 -D__GLASGOW_HASKELL__=702 -Ddarwin_BUILD_OS -Ddarwin_HOST_OS -Di386_BUILD_ARCH -Di386_HOST_ARCH -I/Library/Frameworks/GHC.framework/Versions/7.2.1-x86_64/usr/lib/ghc-7.2.1/bytestring-0.9.2.0/include -I/Library/Frameworks/GHC.framework/Versions/7.2.1-x86_64/usr/lib/ghc-7.2.1/base-4.4.0.0/include -I/Library/Frameworks/GHC.framework/Versions/7.2.1-x86_64/usr/lib/ghc-7.2.1/include -I/Library/Frameworks/GHC.framework/Versions/7.2.1-x86_64/usr/lib/ghc-7.2.1/include -I/Library/Frameworks/GHC.framework/Versions/7.2.1-x86_64/usr/lib/ghc-7.2.1/include/
    cabal: Error: some packages failed to install:
    HTTP-4000.2.2 depends on transformers-0.2.2.0 which failed to install.
    aeson-0.6.0.0 depends on transformers-0.2.2.0 which failed to install.
    attoparsec-0.10.1.0 depends on deepseq-1.3.0.0 which failed to install.
    base-unicode-symbols-0.2.2.3 failed during the final install step. The
    exception was:
    ExitFailure 1
    blaze-builder-0.3.1.0 depends on deepseq-1.3.0.0 which failed to install.
    blaze-html-0.4.3.1 depends on deepseq-1.3.0.0 which failed to install.
    conduit-0.1.1.1 depends on transformers-0.2.2.0 which failed to install.
    cpphs-1.13.2 failed during the final install step. The exception was:
    ExitFailure 1
    deepseq-1.3.0.0 failed during the final install step. The exception was:
    ExitFailure 1
    derive-2.5.5 depends on transformers-0.2.2.0 which failed to install.
    dlist-0.5 failed during the final install step. The exception was:
    ExitFailure 1
    ghc-paths-0.1.0.8 failed during the final install step. The exception was:
    ExitFailure 1
    hashable-1.1.2.2 depends on deepseq-1.3.0.0 which failed to install.
    haskeline-0.6.4.6 depends on utf8-string-0.3.7 which failed to install.
    haskell-src-exts-1.11.1 depends on cpphs-1.13.2 which failed to install.
    lifted-base-0.1.0.3 depends on transformers-0.2.2.0 which failed to install.
    monad-control-0.3.1 depends on transformers-0.2.2.0 which failed to install.
    mtl-2.0.1.0 depends on transformers-0.2.2.0 which failed to install.
    network-2.3.0.10 depends on transformers-0.2.2.0 which failed to install.
    parallel-io-0.3.2 depends on random-1.0.1.1 which failed to install.
    parsec-3.1.2 depends on transformers-0.2.2.0 which failed to install.
    path-pieces-0.1.0 depends on deepseq-1.3.0.0 which failed to install.
    persistent-0.7.0.1 depends on transformers-0.2.2.0 which failed to install.
    persistent-sqlite-0.7.0 depends on transformers-0.2.2.0 which failed to
    install.
    persistent-template-0.7.0 depends on transformers-0.2.2.0 which failed to
    install.
    pool-conduit-0.0.0.1 depends on transformers-0.2.2.0 which failed to install.
    primitive-0.4.1 failed during the final install step. The exception was:
    ExitFailure 1
    random-1.0.1.1 failed during the final install step. The exception was:
    ExitFailure 1
    resource-pool-0.2.1.0 depends on transformers-0.2.2.0 which failed to install.
    scion-browser-0.2.6 depends on zlib-0.5.3.2 which failed to install.
    stm-2.2.0.1 failed during the final install step. The exception was:
    ExitFailure 1
    syb-0.3.6 failed during the final install step. The exception was:
    ExitFailure 1
    tar-0.3.2.0 failed during the final install step. The exception was:
    ExitFailure 1
    terminfo-0.3.2.3 failed during the final install step. The exception was:
    ExitFailure 1
    text-0.11.1.13 depends on deepseq-1.3.0.0 which failed to install.
    transformers-0.2.2.0 failed during the final install step. The exception was:
    ExitFailure 1
    transformers-base-0.4.1 depends on transformers-0.2.2.0 which failed to
    install.
    uniplate-1.6.5 depends on syb-0.3.6 which failed to install.
    unordered-containers-0.1.4.6 depends on deepseq-1.3.0.0 which failed to
    install.
    utf8-string-0.3.7 failed during the final install step. The exception was:
    ExitFailure 1
    vector-0.9.1 depends on primitive-0.4.1 which failed to install.
    zlib-0.5.3.2 failed during the building phase. The exception was:
    ExitFailure 1

     
  • Michael Jones

    Michael Jones - 2012-02-06

    Yeah, I managed to get EclipseFP partially working, but only by manually building all the bits.  EclipseFP failed to build the tools for me similarly to yours.

    I seem to recall I manually unpacked zlib into a directory, and found the offending lines in that .hsc file… it's a macro conditional test.  I just removed one clause or the other and the surrounding conditional #if/#else/#endif, to make zlib go through.  Then I was able to get zlib to build.

    You should probably build scion-browser and buildwrapper from the git sources until we get the OSX thing figured out.  And by we, I mean, the haphazard poking at it with a stick you and I are doing, and JP's cleverness. ;)  With some careful manual building, I've at least gotten as far as having EclipseFP able to create and edit projects and run stuff in the debugger.

    Anyway, just my two bits.

     
  • JP Moresmau

    JP Moresmau - 2012-02-06

    pmonday, EclipseFP builds scion-browser with -user by default, so it should work. You can manually install zlib in -user, then start EclipseFP and the rest should install fine. you can also just install scion-browser manually, then cancel when EclipseFP asks you to install it, go to the Preferences and specify the path to the generated exe manually.

     

Get latest updates about Open Source Projects, Conferences and News.

Sign up for the SourceForge newsletter:





No, thanks