Ben George - 2012-11-23

HI

Hi i tried to install e2fsprogs-1.42.6

but it got failed. i managed to install almost all dependency packages and make files.

anyone please help me to solve this compile error

final errors are shown below:

CC ../../../lib/ext2fs/unix_io.c
../../../lib/ext2fs/unix_io.c: In function `unix_discard':
../../../lib/ext2fs/unix_io.c:917: error: `__uint64_t' undeclared (first use in this function)
../../../lib/ext2fs/unix_io.c:917: error: (Each undeclared identifier is reported only once
../../../lib/ext2fs/unix_io.c:917: error: for each function it appears in.)
../../../lib/ext2fs/unix_io.c:917: error: syntax error before "range"
*make: ***  Error 1*
make: Leaving directory `/Desktop/e2fs/e2fsprogs-1.42.6/build/lib/ext2fs'
*make: ***  Error 1*
make: Leaving directory `/Desktop/e2fs/e2fsprogs-1.42.6/build'
*make: ***  Error 2*

Regards,
Ben