compile error on redhat 9

Help
2004-08-19
2013-05-28
  • Baruch Shpirer

    Baruch Shpirer - 2004-08-19

    can anyone help me in this error during make ?
    -------------------------------------------

    /usr/lib /usr/lib/libnetsnmp.so -lcrypto -lelf -lm -lresolv
    docsis_lex.o(.text+0x7a7): In function `yylex':
    /root/docsis-0.9.2/src/docsis_lex.c:1494: undefined reference to `yywrap'
    docsis_lex.o(.text+0xea3): In function `input':
    /root/docsis-0.9.2/src/docsis_lex.c:1843: undefined reference to `yywrap'
    collect2: ld returned 1 exit status
    make[2]: *** [docsis] Error 1
    make[2]: Leaving directory `/root/docsis-0.9.2/src'
    make[1]: *** [all-recursive] Error 1
    make[1]: Leaving directory `/root/docsis-0.9.2'
    make: *** [all] Error 2

     
    • martin landinger

      Baruch,
      I had the same error with redhat ES!
      Try to install the flex-2.5.4x-xx.i386.rpm

       

Log in to post a comment.

Get latest updates about Open Source Projects, Conferences and News.

Sign up for the SourceForge newsletter:





No, thanks