Bugs item #806164, was opened at 2003-09-14 16:15
Message generated for change (Tracker Item Submitted) made by Item Submitter
You can respond by visiting:
https://sourceforge.net/tracker/?func=detail&atid=410643&aid=806164&group_id=34096
Category: Build System
Group: v0.6
Status: Open
Resolution: None
Priority: 9
Submitted By: Bruce Smith (blubdog)
Assigned to: Heiko Zuerker (smiley73)
Summary: python-ldap build/compile aborts.
Initial Comment:
make[1]: Entering directory
`/data/build/tmp/python-ldap-20011022'
cd Modules && make
srcdir=/data/build/tmp/python-ldap-20011022/Modules
VPATH=/data/build/tmp/python-ldap-20011022/Modules
make[2]: Entering directory
`/data/build/tmp/python-ldap-20011022/Modules'
i586-pc-linux-gnu-gcc -pthread -fPIC -DNDEBUG -g -O3 -Wall
-Wstrict-prototypes
-I/data/build/tmp/Python-install/usr/include/python2.3
-I/data/build/tmp/Python-install/usr/lib/python2.3/config
@DEFS@ -I.
-DLDAP_REFERRALS
-I/data/build/tmp/openldap-1.2.13/include -c
/data/build/tmp/python-ldap-20011022/Modules/./LDAPObject.c
-o
./LDAPObject.o
i586-pc-linux-gnu-gcc: cannot specify -o with -c or -S
and multiple
compilations
make[2]: *** [LDAPObject.o] Error 1
make[2]: Leaving directory
`/data/build/tmp/python-ldap-20011022/Modules'
make[1]: *** [_ldapmodule-build] Error 2
make[1]: Leaving directory
`/data/build/tmp/python-ldap-20011022'
ERROR
/data/build/scripts/python-ldap build failed
make: *** [build] Error 1
----------------------------------------------------------------------
You can respond by visiting:
https://sourceforge.net/tracker/?func=detail&atid=410643&aid=806164&group_id=34096
|