|
From: Heiko Z. <he...@zu...> - 2003-09-07 15:17:49
|
Hey, I just checked in the changes to get DL working with the new kernel. The workaround for iproute/iputils is, that we use the kernel includes from 2.4.21 until a patch is available. cya Heiko |
|
From: Bruce S. <bw...@ar...> - 2003-09-07 17:09:34
|
> I just checked in the changes to get DL working with the new kernel. And I fixed it (again), so you can download all the sources! ;-) (before my fix:) mirror: Access failed: 550 man-1.5m2.tar.bz2: Permission denied mirror: Access failed: 550 util-linux-2.12.tar.gz: Permission denied - B |
|
From: Heiko Z. <he...@zu...> - 2003-09-07 23:46:22
|
Bruce Smith wrote: >>I just checked in the changes to get DL working with the new kernel. > > > And I fixed it (again), so you can download all the sources! ;-) > > (before my fix:) > mirror: Access failed: 550 man-1.5m2.tar.bz2: Permission denied > mirror: Access failed: 550 util-linux-2.12.tar.gz: Permission denied > That's not fair! I actually ran a update_src to see if all files are downloaded and it worked ! grrrrr cya Heiko |
|
From: Bruce S. <bw...@ar...> - 2003-09-07 17:54:35
|
> I just checked in the changes to get DL working with the new kernel.
> The workaround for iproute/iputils is, that we use the kernel includes
> from 2.4.21 until a patch is available.
make mrproper unpack build install iso
.......
ranlib libbackend.a
stage1/xgcc -Bstage1/ -B/usr/i686-pc-linux-gnu/bin/ -DIN_GCC -g -O2
-W -Wall
-Wwrite-strings -Wstrict-prototypes -Wmissing-prototypes -Wtraditional
-pedantic -Wno-long-long -DHAVE_CONFIG_H -o cc1 \
c-parse.o c-lang.o attribs.o c-errors.o c-lex.o c-pragma.o
c-decl.o c-typeck.o c-convert.o c-aux-info.o c-common.o c-format.o
c-semantics.o c-objc-common.o libcpp.a main.o libbackend.a
../libiberty/libiberty.a
../libiberty/libiberty.a(md5.o)(.text+0x123): In function `md5_stream':
../../gcc-3.2.3/libiberty/md5.c:135: undefined reference to `__guard'
../libiberty/libiberty.a(md5.o)(.text+0x1fb):../../gcc-3.2.3/libiberty/md5.c:182: undefined reference to `__guard'
../libiberty/libiberty.a(md5.o)(.text+0x23c):../../gcc-3.2.3/libiberty/md5.c:162: undefined reference to `__stack_smash_handler'
../libiberty/libiberty.a(md5.o)(.text+0x24d): In function `md5_buffer':
../../gcc-3.2.3/libiberty/md5.c:193: undefined reference to `__guard'
../libiberty/libiberty.a(md5.o)(.text+0x28f):../../gcc-3.2.3/libiberty/md5.c:204: undefined reference to `__guard'
../libiberty/libiberty.a(md5.o)(.text+0x2ae):../../gcc-3.2.3/libiberty/md5.c:204: undefined reference to `__stack_smash_handler'
collect2: ld returned 1 exit status
make[3]: *** [cc1] Error 1
make[3]: Leaving directory `/data/build/tmp/gcc-build/gcc'
make[2]: *** [stage2_build] Error 2
make[2]: Leaving directory `/data/build/tmp/gcc-build/gcc'
make[1]: *** [bootstrap] Error 2
make[1]: Leaving directory `/data/build/tmp/gcc-build'
ERROR
/data/build/scripts/gcc build failed
make: *** [build] Error 1
|
|
From: Bruce S. <bw...@ar...> - 2003-09-07 23:34:30
|
> make mrproper unpack build install iso > > ....... Forget the previous abort. I started with a fresh lfssystem and it got farther, but still aborted: make -C usb make[3]: Entering directory `/data/build/tmp/linux-2.4.22/drivers/usb' make -C host make[4]: Entering directory `/data/build/tmp/linux-2.4.22/drivers/usb/host' make all_targets make[5]: Entering directory `/data/build/tmp/linux-2.4.22/drivers/usb/host' make[5]: Nothing to be done for `all_targets'. make[5]: Leaving directory `/data/build/tmp/linux-2.4.22/drivers/usb/host' make[4]: Leaving directory `/data/build/tmp/linux-2.4.22/drivers/usb/host' make -C storage make[4]: Entering directory `/data/build/tmp/linux-2.4.22/drivers/usb/storage' make all_targets make[5]: Entering directory `/data/build/tmp/linux-2.4.22/drivers/usb/storage' gcc -D__KERNEL__ -I/data/build/tmp/linux-2.4.22/include -Wall -Wstrict-prototypes -Wno-trigraphs -O2 -fno-strict-aliasing -fno-common -fomit-frame-pointer -fno-stack-protector -pipe -mpreferred-stack-boundary=2 -march=i686 -I../../scsi/ -nostdinc -iwithprefix include -DKBUILD_BASENAME=scsiglue -c -o scsiglue.o scsiglue.c gcc -D__KERNEL__ -I/data/build/tmp/linux-2.4.22/include -Wall -Wstrict-prototypes -Wno-trigraphs -O2 -fno-strict-aliasing -fno-common -fomit-frame-pointer -fno-stack-protector -pipe -mpreferred-stack-boundary=2 -march=i686 -I../../scsi/ -nostdinc -iwithprefix include -DKBUILD_BASENAME=protocol -c -o protocol.o protocol.c gcc -D__KERNEL__ -I/data/build/tmp/linux-2.4.22/include -Wall -Wstrict-prototypes -Wno-trigraphs -O2 -fno-strict-aliasing -fno-common -fomit-frame-pointer -fno-stack-protector -pipe -mpreferred-stack-boundary=2 -march=i686 -I../../scsi/ -nostdinc -iwithprefix include -DKBUILD_BASENAME=transport -c -o transport.o transport.c gcc -D__KERNEL__ -I/data/build/tmp/linux-2.4.22/include -Wall -Wstrict-prototypes -Wno-trigraphs -O2 -fno-strict-aliasing -fno-common -fomit-frame-pointer -fno-stack-protector -pipe -mpreferred-stack-boundary=2 -march=i686 -I../../scsi/ -nostdinc -iwithprefix include -DKBUILD_BASENAME=usb -c -o usb.o usb.c In file included from usb.c:192: unusual_devs.h:224: `US_FL_START_STOP' undeclared here (not in a function) unusual_devs.h:224: initializer element is not constant unusual_devs.h:224: (near initialization for `us_unusual_dev_list[26].flags') unusual_devs.h:224: initializer element is not constant unusual_devs.h:224: (near initialization for `us_unusual_dev_list[26]') unusual_devs.h:232: initializer element is not constant unusual_devs.h:232: (near initialization for `us_unusual_dev_list[27]') unusual_devs.h:242: initializer element is not constant unusual_devs.h:242: (near initialization for `us_unusual_dev_list[28]') unusual_devs.h:249: initializer element is not constant unusual_devs.h:249: (near initialization for `us_unusual_dev_list[29]') unusual_devs.h:256: initializer element is not constant unusual_devs.h:256: (near initialization for `us_unusual_dev_list[30]') unusual_devs.h:263: initializer element is not constant unusual_devs.h:263: (near initialization for `us_unusual_dev_list[31]') unusual_devs.h:270: initializer element is not constant unusual_devs.h:270: (near initialization for `us_unusual_dev_list[32]') unusual_devs.h:277: initializer element is not constant unusual_devs.h:277: (near initialization for `us_unusual_dev_list[33]') unusual_devs.h:283: initializer element is not constant unusual_devs.h:283: (near initialization for `us_unusual_dev_list[34]') unusual_devs.h:289: initializer element is not constant unusual_devs.h:289: (near initialization for `us_unusual_dev_list[35]') unusual_devs.h:296: initializer element is not constant unusual_devs.h:296: (near initialization for `us_unusual_dev_list[36]') unusual_devs.h:302: initializer element is not constant unusual_devs.h:302: (near initialization for `us_unusual_dev_list[37]') unusual_devs.h:308: initializer element is not constant unusual_devs.h:308: (near initialization for `us_unusual_dev_list[38]') unusual_devs.h:313: initializer element is not constant unusual_devs.h:313: (near initialization for `us_unusual_dev_list[39]') unusual_devs.h:320: initializer element is not constant unusual_devs.h:320: (near initialization for `us_unusual_dev_list[40]') unusual_devs.h:326: initializer element is not constant unusual_devs.h:326: (near initialization for `us_unusual_dev_list[41]') unusual_devs.h:332: initializer element is not constant unusual_devs.h:332: (near initialization for `us_unusual_dev_list[42]') unusual_devs.h:338: initializer element is not constant unusual_devs.h:338: (near initialization for `us_unusual_dev_list[43]') unusual_devs.h:346: initializer element is not constant unusual_devs.h:346: (near initialization for `us_unusual_dev_list[44]') unusual_devs.h:354: initializer element is not constant unusual_devs.h:354: (near initialization for `us_unusual_dev_list[45]') unusual_devs.h:364: initializer element is not constant unusual_devs.h:364: (near initialization for `us_unusual_dev_list[46]') unusual_devs.h:377: initializer element is not constant unusual_devs.h:377: (near initialization for `us_unusual_dev_list[47]') unusual_devs.h:385: initializer element is not constant unusual_devs.h:385: (near initialization for `us_unusual_dev_list[48]') unusual_devs.h:390: initializer element is not constant unusual_devs.h:390: (near initialization for `us_unusual_dev_list[49]') unusual_devs.h:397: initializer element is not constant unusual_devs.h:397: (near initialization for `us_unusual_dev_list[50]') unusual_devs.h:403: initializer element is not constant unusual_devs.h:403: (near initialization for `us_unusual_dev_list[51]') unusual_devs.h:408: initializer element is not constant unusual_devs.h:408: (near initialization for `us_unusual_dev_list[52]') unusual_devs.h:414: initializer element is not constant unusual_devs.h:414: (near initialization for `us_unusual_dev_list[53]') unusual_devs.h:420: initializer element is not constant unusual_devs.h:420: (near initialization for `us_unusual_dev_list[54]') unusual_devs.h:426: initializer element is not constant unusual_devs.h:426: (near initialization for `us_unusual_dev_list[55]') unusual_devs.h:433: initializer element is not constant unusual_devs.h:433: (near initialization for `us_unusual_dev_list[56]') unusual_devs.h:440: initializer element is not constant unusual_devs.h:440: (near initialization for `us_unusual_dev_list[57]') unusual_devs.h:447: initializer element is not constant unusual_devs.h:447: (near initialization for `us_unusual_dev_list[58]') unusual_devs.h:453: initializer element is not constant unusual_devs.h:453: (near initialization for `us_unusual_dev_list[59]') unusual_devs.h:459: initializer element is not constant unusual_devs.h:459: (near initialization for `us_unusual_dev_list[60]') unusual_devs.h:467: initializer element is not constant unusual_devs.h:467: (near initialization for `us_unusual_dev_list[61]') unusual_devs.h:484: initializer element is not constant unusual_devs.h:484: (near initialization for `us_unusual_dev_list[62]') unusual_devs.h:490: initializer element is not constant unusual_devs.h:490: (near initialization for `us_unusual_dev_list[63]') unusual_devs.h:496: initializer element is not constant unusual_devs.h:496: (near initialization for `us_unusual_dev_list[64]') unusual_devs.h:502: initializer element is not constant unusual_devs.h:502: (near initialization for `us_unusual_dev_list[65]') unusual_devs.h:508: initializer element is not constant unusual_devs.h:508: (near initialization for `us_unusual_dev_list[66]') unusual_devs.h:517: initializer element is not constant unusual_devs.h:517: (near initialization for `us_unusual_dev_list[67]') unusual_devs.h:526: initializer element is not constant unusual_devs.h:526: (near initialization for `us_unusual_dev_list[68]') unusual_devs.h:539: initializer element is not constant unusual_devs.h:539: (near initialization for `us_unusual_dev_list[69]') unusual_devs.h:552: initializer element is not constant unusual_devs.h:552: (near initialization for `us_unusual_dev_list[70]') unusual_devs.h:559: initializer element is not constant unusual_devs.h:559: (near initialization for `us_unusual_dev_list[71]') unusual_devs.h:568: initializer element is not constant unusual_devs.h:568: (near initialization for `us_unusual_dev_list[72]') unusual_devs.h:575: initializer element is not constant unusual_devs.h:575: (near initialization for `us_unusual_dev_list[73]') unusual_devs.h:581: initializer element is not constant unusual_devs.h:581: (near initialization for `us_unusual_dev_list[74]') unusual_devs.h:587: initializer element is not constant unusual_devs.h:587: (near initialization for `us_unusual_dev_list[75]') unusual_devs.h:600: initializer element is not constant unusual_devs.h:600: (near initialization for `us_unusual_dev_list[76]') unusual_devs.h:607: initializer element is not constant unusual_devs.h:607: (near initialization for `us_unusual_dev_list[77]') unusual_devs.h:614: initializer element is not constant unusual_devs.h:614: (near initialization for `us_unusual_dev_list[78]') unusual_devs.h:625: initializer element is not constant unusual_devs.h:625: (near initialization for `us_unusual_dev_list[79]') unusual_devs.h:636: initializer element is not constant unusual_devs.h:636: (near initialization for `us_unusual_dev_list[80]') unusual_devs.h:643: initializer element is not constant unusual_devs.h:643: (near initialization for `us_unusual_dev_list[81]') usb.c:196: initializer element is not constant usb.c:196: (near initialization for `us_unusual_dev_list[82]') usb.c:198: initializer element is not constant usb.c:198: (near initialization for `us_unusual_dev_list[83]') usb.c:200: initializer element is not constant usb.c:200: (near initialization for `us_unusual_dev_list[84]') usb.c:202: initializer element is not constant usb.c:202: (near initialization for `us_unusual_dev_list[85]') usb.c:204: initializer element is not constant usb.c:204: (near initialization for `us_unusual_dev_list[86]') usb.c:206: initializer element is not constant usb.c:206: (near initialization for `us_unusual_dev_list[87]') usb.c:210: initializer element is not constant usb.c:210: (near initialization for `us_unusual_dev_list[88]') usb.c:212: initializer element is not constant usb.c:212: (near initialization for `us_unusual_dev_list[89]') usb.c:214: initializer element is not constant usb.c:214: (near initialization for `us_unusual_dev_list[90]') usb.c:216: initializer element is not constant usb.c:216: (near initialization for `us_unusual_dev_list[91]') usb.c:218: initializer element is not constant usb.c:218: (near initialization for `us_unusual_dev_list[92]') usb.c:220: initializer element is not constant usb.c:220: (near initialization for `us_unusual_dev_list[93]') usb.c:224: initializer element is not constant usb.c:224: (near initialization for `us_unusual_dev_list[94]') usb.c:226: initializer element is not constant usb.c:226: (near initialization for `us_unusual_dev_list[95]') usb.c:228: initializer element is not constant usb.c:228: (near initialization for `us_unusual_dev_list[96]') usb.c:230: initializer element is not constant usb.c:230: (near initialization for `us_unusual_dev_list[97]') usb.c:232: initializer element is not constant usb.c:232: (near initialization for `us_unusual_dev_list[98]') usb.c:234: initializer element is not constant usb.c:234: (near initialization for `us_unusual_dev_list[99]') usb.c:237: initializer element is not constant usb.c:237: (near initialization for `us_unusual_dev_list[100]') zio_cf.h:34: warning: `drive' defined but not used make[5]: *** [usb.o] Error 1 make[5]: Leaving directory `/data/build/tmp/linux-2.4.22/drivers/usb/storage' make[4]: *** [first_rule] Error 2 make[4]: Leaving directory `/data/build/tmp/linux-2.4.22/drivers/usb/storage' make[3]: *** [_subdir_storage] Error 2 make[3]: Leaving directory `/data/build/tmp/linux-2.4.22/drivers/usb' make[2]: *** [_subdir_usb] Error 2 make[2]: Leaving directory `/data/build/tmp/linux-2.4.22/drivers' make[1]: *** [_dir_drivers] Error 2 make[1]: Leaving directory `/data/build/tmp/linux-2.4.22' ERROR /data/build/scripts/linux build failed make: *** [build] Error 1 |
|
From: Heiko Z. <he...@zu...> - 2003-09-07 23:50:30
|
OOOPS I forgott to mention something. ;-) De-Select System/USBAT-2 Support in "make menuconfig". Heiko Bruce Smith wrote: >>make mrproper unpack build install iso >> >>....... > > > Forget the previous abort. I started with a fresh lfssystem and it got > farther, but still aborted: > > make -C usb > make[3]: Entering directory `/data/build/tmp/linux-2.4.22/drivers/usb' > make -C host > make[4]: Entering directory `/data/build/tmp/linux-2.4.22/drivers/usb/host' > make all_targets > make[5]: Entering directory `/data/build/tmp/linux-2.4.22/drivers/usb/host' > make[5]: Nothing to be done for `all_targets'. > make[5]: Leaving directory `/data/build/tmp/linux-2.4.22/drivers/usb/host' > make[4]: Leaving directory `/data/build/tmp/linux-2.4.22/drivers/usb/host' > make -C storage > make[4]: Entering directory `/data/build/tmp/linux-2.4.22/drivers/usb/storage' > make all_targets > make[5]: Entering directory `/data/build/tmp/linux-2.4.22/drivers/usb/storage' > gcc -D__KERNEL__ -I/data/build/tmp/linux-2.4.22/include -Wall -Wstrict-prototypes -Wno-trigraphs -O2 -fno-strict-aliasing -fno-common -fomit-frame-pointer -fno-stack-protector -pipe -mpreferred-stack-boundary=2 -march=i686 -I../../scsi/ -nostdinc -iwithprefix include -DKBUILD_BASENAME=scsiglue -c -o scsiglue.o scsiglue.c > gcc -D__KERNEL__ -I/data/build/tmp/linux-2.4.22/include -Wall -Wstrict-prototypes -Wno-trigraphs -O2 -fno-strict-aliasing -fno-common -fomit-frame-pointer -fno-stack-protector -pipe -mpreferred-stack-boundary=2 -march=i686 -I../../scsi/ -nostdinc -iwithprefix include -DKBUILD_BASENAME=protocol -c -o protocol.o protocol.c > gcc -D__KERNEL__ -I/data/build/tmp/linux-2.4.22/include -Wall -Wstrict-prototypes -Wno-trigraphs -O2 -fno-strict-aliasing -fno-common -fomit-frame-pointer -fno-stack-protector -pipe -mpreferred-stack-boundary=2 -march=i686 -I../../scsi/ -nostdinc -iwithprefix include -DKBUILD_BASENAME=transport -c -o transport.o transport.c > gcc -D__KERNEL__ -I/data/build/tmp/linux-2.4.22/include -Wall -Wstrict-prototypes -Wno-trigraphs -O2 -fno-strict-aliasing -fno-common -fomit-frame-pointer -fno-stack-protector -pipe -mpreferred-stack-boundary=2 -march=i686 -I../../scsi/ -nostdinc -iwithprefix include -DKBUILD_BASENAME=usb -c -o usb.o usb.c > In file included from usb.c:192: > unusual_devs.h:224: `US_FL_START_STOP' undeclared here (not in a function) > unusual_devs.h:224: initializer element is not constant > unusual_devs.h:224: (near initialization for `us_unusual_dev_list[26].flags') > unusual_devs.h:224: initializer element is not constant > unusual_devs.h:224: (near initialization for `us_unusual_dev_list[26]') > unusual_devs.h:232: initializer element is not constant > unusual_devs.h:232: (near initialization for `us_unusual_dev_list[27]') > unusual_devs.h:242: initializer element is not constant > unusual_devs.h:242: (near initialization for `us_unusual_dev_list[28]') > unusual_devs.h:249: initializer element is not constant > unusual_devs.h:249: (near initialization for `us_unusual_dev_list[29]') > unusual_devs.h:256: initializer element is not constant > unusual_devs.h:256: (near initialization for `us_unusual_dev_list[30]') > unusual_devs.h:263: initializer element is not constant > unusual_devs.h:263: (near initialization for `us_unusual_dev_list[31]') > unusual_devs.h:270: initializer element is not constant > unusual_devs.h:270: (near initialization for `us_unusual_dev_list[32]') > unusual_devs.h:277: initializer element is not constant > unusual_devs.h:277: (near initialization for `us_unusual_dev_list[33]') > unusual_devs.h:283: initializer element is not constant > unusual_devs.h:283: (near initialization for `us_unusual_dev_list[34]') > unusual_devs.h:289: initializer element is not constant > unusual_devs.h:289: (near initialization for `us_unusual_dev_list[35]') > unusual_devs.h:296: initializer element is not constant > unusual_devs.h:296: (near initialization for `us_unusual_dev_list[36]') > unusual_devs.h:302: initializer element is not constant > unusual_devs.h:302: (near initialization for `us_unusual_dev_list[37]') > unusual_devs.h:308: initializer element is not constant > unusual_devs.h:308: (near initialization for `us_unusual_dev_list[38]') > unusual_devs.h:313: initializer element is not constant > unusual_devs.h:313: (near initialization for `us_unusual_dev_list[39]') > unusual_devs.h:320: initializer element is not constant > unusual_devs.h:320: (near initialization for `us_unusual_dev_list[40]') > unusual_devs.h:326: initializer element is not constant > unusual_devs.h:326: (near initialization for `us_unusual_dev_list[41]') > unusual_devs.h:332: initializer element is not constant > unusual_devs.h:332: (near initialization for `us_unusual_dev_list[42]') > unusual_devs.h:338: initializer element is not constant > unusual_devs.h:338: (near initialization for `us_unusual_dev_list[43]') > unusual_devs.h:346: initializer element is not constant > unusual_devs.h:346: (near initialization for `us_unusual_dev_list[44]') > unusual_devs.h:354: initializer element is not constant > unusual_devs.h:354: (near initialization for `us_unusual_dev_list[45]') > unusual_devs.h:364: initializer element is not constant > unusual_devs.h:364: (near initialization for `us_unusual_dev_list[46]') > unusual_devs.h:377: initializer element is not constant > unusual_devs.h:377: (near initialization for `us_unusual_dev_list[47]') > unusual_devs.h:385: initializer element is not constant > unusual_devs.h:385: (near initialization for `us_unusual_dev_list[48]') > unusual_devs.h:390: initializer element is not constant > unusual_devs.h:390: (near initialization for `us_unusual_dev_list[49]') > unusual_devs.h:397: initializer element is not constant > unusual_devs.h:397: (near initialization for `us_unusual_dev_list[50]') > unusual_devs.h:403: initializer element is not constant > unusual_devs.h:403: (near initialization for `us_unusual_dev_list[51]') > unusual_devs.h:408: initializer element is not constant > unusual_devs.h:408: (near initialization for `us_unusual_dev_list[52]') > unusual_devs.h:414: initializer element is not constant > unusual_devs.h:414: (near initialization for `us_unusual_dev_list[53]') > unusual_devs.h:420: initializer element is not constant > unusual_devs.h:420: (near initialization for `us_unusual_dev_list[54]') > unusual_devs.h:426: initializer element is not constant > unusual_devs.h:426: (near initialization for `us_unusual_dev_list[55]') > unusual_devs.h:433: initializer element is not constant > unusual_devs.h:433: (near initialization for `us_unusual_dev_list[56]') > unusual_devs.h:440: initializer element is not constant > unusual_devs.h:440: (near initialization for `us_unusual_dev_list[57]') > unusual_devs.h:447: initializer element is not constant > unusual_devs.h:447: (near initialization for `us_unusual_dev_list[58]') > unusual_devs.h:453: initializer element is not constant > unusual_devs.h:453: (near initialization for `us_unusual_dev_list[59]') > unusual_devs.h:459: initializer element is not constant > unusual_devs.h:459: (near initialization for `us_unusual_dev_list[60]') > unusual_devs.h:467: initializer element is not constant > unusual_devs.h:467: (near initialization for `us_unusual_dev_list[61]') > unusual_devs.h:484: initializer element is not constant > unusual_devs.h:484: (near initialization for `us_unusual_dev_list[62]') > unusual_devs.h:490: initializer element is not constant > unusual_devs.h:490: (near initialization for `us_unusual_dev_list[63]') > unusual_devs.h:496: initializer element is not constant > unusual_devs.h:496: (near initialization for `us_unusual_dev_list[64]') > unusual_devs.h:502: initializer element is not constant > unusual_devs.h:502: (near initialization for `us_unusual_dev_list[65]') > unusual_devs.h:508: initializer element is not constant > unusual_devs.h:508: (near initialization for `us_unusual_dev_list[66]') > unusual_devs.h:517: initializer element is not constant > unusual_devs.h:517: (near initialization for `us_unusual_dev_list[67]') > unusual_devs.h:526: initializer element is not constant > unusual_devs.h:526: (near initialization for `us_unusual_dev_list[68]') > unusual_devs.h:539: initializer element is not constant > unusual_devs.h:539: (near initialization for `us_unusual_dev_list[69]') > unusual_devs.h:552: initializer element is not constant > unusual_devs.h:552: (near initialization for `us_unusual_dev_list[70]') > unusual_devs.h:559: initializer element is not constant > unusual_devs.h:559: (near initialization for `us_unusual_dev_list[71]') > unusual_devs.h:568: initializer element is not constant > unusual_devs.h:568: (near initialization for `us_unusual_dev_list[72]') > unusual_devs.h:575: initializer element is not constant > unusual_devs.h:575: (near initialization for `us_unusual_dev_list[73]') > unusual_devs.h:581: initializer element is not constant > unusual_devs.h:581: (near initialization for `us_unusual_dev_list[74]') > unusual_devs.h:587: initializer element is not constant > unusual_devs.h:587: (near initialization for `us_unusual_dev_list[75]') > unusual_devs.h:600: initializer element is not constant > unusual_devs.h:600: (near initialization for `us_unusual_dev_list[76]') > unusual_devs.h:607: initializer element is not constant > unusual_devs.h:607: (near initialization for `us_unusual_dev_list[77]') > unusual_devs.h:614: initializer element is not constant > unusual_devs.h:614: (near initialization for `us_unusual_dev_list[78]') > unusual_devs.h:625: initializer element is not constant > unusual_devs.h:625: (near initialization for `us_unusual_dev_list[79]') > unusual_devs.h:636: initializer element is not constant > unusual_devs.h:636: (near initialization for `us_unusual_dev_list[80]') > unusual_devs.h:643: initializer element is not constant > unusual_devs.h:643: (near initialization for `us_unusual_dev_list[81]') > usb.c:196: initializer element is not constant > usb.c:196: (near initialization for `us_unusual_dev_list[82]') > usb.c:198: initializer element is not constant > usb.c:198: (near initialization for `us_unusual_dev_list[83]') > usb.c:200: initializer element is not constant > usb.c:200: (near initialization for `us_unusual_dev_list[84]') > usb.c:202: initializer element is not constant > usb.c:202: (near initialization for `us_unusual_dev_list[85]') > usb.c:204: initializer element is not constant > usb.c:204: (near initialization for `us_unusual_dev_list[86]') > usb.c:206: initializer element is not constant > usb.c:206: (near initialization for `us_unusual_dev_list[87]') > usb.c:210: initializer element is not constant > usb.c:210: (near initialization for `us_unusual_dev_list[88]') > usb.c:212: initializer element is not constant > usb.c:212: (near initialization for `us_unusual_dev_list[89]') > usb.c:214: initializer element is not constant > usb.c:214: (near initialization for `us_unusual_dev_list[90]') > usb.c:216: initializer element is not constant > usb.c:216: (near initialization for `us_unusual_dev_list[91]') > usb.c:218: initializer element is not constant > usb.c:218: (near initialization for `us_unusual_dev_list[92]') > usb.c:220: initializer element is not constant > usb.c:220: (near initialization for `us_unusual_dev_list[93]') > usb.c:224: initializer element is not constant > usb.c:224: (near initialization for `us_unusual_dev_list[94]') > usb.c:226: initializer element is not constant > usb.c:226: (near initialization for `us_unusual_dev_list[95]') > usb.c:228: initializer element is not constant > usb.c:228: (near initialization for `us_unusual_dev_list[96]') > usb.c:230: initializer element is not constant > usb.c:230: (near initialization for `us_unusual_dev_list[97]') > usb.c:232: initializer element is not constant > usb.c:232: (near initialization for `us_unusual_dev_list[98]') > usb.c:234: initializer element is not constant > usb.c:234: (near initialization for `us_unusual_dev_list[99]') > usb.c:237: initializer element is not constant > usb.c:237: (near initialization for `us_unusual_dev_list[100]') > zio_cf.h:34: warning: `drive' defined but not used > make[5]: *** [usb.o] Error 1 > make[5]: Leaving directory > `/data/build/tmp/linux-2.4.22/drivers/usb/storage' > make[4]: *** [first_rule] Error 2 > make[4]: Leaving directory > `/data/build/tmp/linux-2.4.22/drivers/usb/storage' > make[3]: *** [_subdir_storage] Error 2 > make[3]: Leaving directory `/data/build/tmp/linux-2.4.22/drivers/usb' > make[2]: *** [_subdir_usb] Error 2 > make[2]: Leaving directory `/data/build/tmp/linux-2.4.22/drivers' > make[1]: *** [_dir_drivers] Error 2 > make[1]: Leaving directory `/data/build/tmp/linux-2.4.22' > ERROR > /data/build/scripts/linux build failed > make: *** [build] Error 1 |
|
From: Thomas E. <tho...@bu...> - 2003-09-10 06:54:20
|
Heiko Zuerker wrote:
> OOOPS I forgott to mention something. ;-)
> De-Select System/USBAT-2 Support in "make menuconfig".
Is this the only problem?
After a "make mrproper unpack build" it breaks:
[...]
*
* IP: Netfilter Configuration
*
Connection tracking (required for masq/NAT) (CONFIG_IP_NF_CONNTRACK)
[M/n/y/?]
FTP protocol support (CONFIG_IP_NF_FTP) [M/n/?]
Amanda protocol support (CONFIG_IP_NF_AMANDA) [M/n/?]
TFTP protocol support (CONFIG_IP_NF_TFTP) [M/n/?]
IRC protocol support (CONFIG_IP_NF_IRC) [M/n/?]
Userspace queueing via NETLINK (EXPERIMENTAL) (CONFIG_IP_NF_QUEUE) [M/n/y/?]
IP tables support (required for filtering/masq/NAT)
(CONFIG_IP_NF_IPTABLES) [M/n/y/?]
limit match support (CONFIG_IP_NF_MATCH_LIMIT) [M/n/?]
MAC address match support (CONFIG_IP_NF_MATCH_MAC) [M/n/?]
Packet type match support (CONFIG_IP_NF_MATCH_PKTTYPE) [M/n/?]
netfilter MARK match support (CONFIG_IP_NF_MATCH_MARK) [M/n/?]
Multiple port match support (CONFIG_IP_NF_MATCH_MULTIPORT) [M/n/?]
TOS match support (CONFIG_IP_NF_MATCH_TOS) [M/n/?]
recent match support (CONFIG_IP_NF_MATCH_RECENT) [N/m/?] (NEW)
[...]
EISA, VLB, PCI and on board controllers (CONFIG_NET_PCI) [Y/n/?]
AMD PCnet32 PCI support (CONFIG_PCNET32) [M/n/y/?]
AMD 8111 (new PCI lance) support (CONFIG_AMD8111_ETH) [M/n/y/?]
Adaptec Starfire/DuraLAN support (CONFIG_ADAPTEC_STARFIRE) [M/n/y/?]
Ansel Communications EISA 3200 support (EXPERIMENTAL)
(CONFIG_AC3200) [M/n/y/?]
Apricot Xen-II on board Ethernet (CONFIG_APRICOT) [M/n/y/?]
Broadcom 4400 ethernet support (EXPERIMENTAL) (CONFIG_B44)
[N/y/m/?] (NEW)
[...]
*
* File systems
*
Quota support (CONFIG_QUOTA) [Y/n/?]
VFS v0 quota format support (CONFIG_QFMT_V2) [N/y/m/?] (NEW)
[...]
Apple HFS+ (Extended HFS) file system support (EXPERIMENTAL)
(CONFIG_HFSPLUS_FS) [N/y/m/?] (NEW)
[...]
USB ASIX AX88172 based ethernet device support (EXPERIMENTAL)
(CONFIG_USB_AX8817X) [N/y/m/?] (NEW)
[...]
*
* Cryptographic options
*
Cryptographic API (CONFIG_CRYPTO) [N/y/?] (NEW)
*
* Library routines
*
CRC32 functions (CONFIG_CRC32) [N/y/m/?] (NEW)
[...]
--
thomas
|
|
From: Heiko Z. <he...@zu...> - 2003-09-07 23:46:23
|
Bruce Smith wrote: >>I just checked in the changes to get DL working with the new kernel. >>The workaround for iproute/iputils is, that we use the kernel includes >>from 2.4.21 until a patch is available. > > > make mrproper unpack build install iso > > ....... > > ranlib libbackend.a > stage1/xgcc -Bstage1/ -B/usr/i686-pc-linux-gnu/bin/ -DIN_GCC -g -O2 > -W -Wall > -Wwrite-strings -Wstrict-prototypes -Wmissing-prototypes -Wtraditional > -pedantic -Wno-long-long -DHAVE_CONFIG_H -o cc1 \ > c-parse.o c-lang.o attribs.o c-errors.o c-lex.o c-pragma.o > c-decl.o c-typeck.o c-convert.o c-aux-info.o c-common.o c-format.o > c-semantics.o c-objc-common.o libcpp.a main.o libbackend.a > ../libiberty/libiberty.a > ../libiberty/libiberty.a(md5.o)(.text+0x123): In function `md5_stream': > ../../gcc-3.2.3/libiberty/md5.c:135: undefined reference to `__guard' > ../libiberty/libiberty.a(md5.o)(.text+0x1fb):../../gcc-3.2.3/libiberty/md5.c:182: undefined reference to `__guard' > ../libiberty/libiberty.a(md5.o)(.text+0x23c):../../gcc-3.2.3/libiberty/md5.c:162: undefined reference to `__stack_smash_handler' > ../libiberty/libiberty.a(md5.o)(.text+0x24d): In function `md5_buffer': > ../../gcc-3.2.3/libiberty/md5.c:193: undefined reference to `__guard' > ../libiberty/libiberty.a(md5.o)(.text+0x28f):../../gcc-3.2.3/libiberty/md5.c:204: undefined reference to `__guard' > ../libiberty/libiberty.a(md5.o)(.text+0x2ae):../../gcc-3.2.3/libiberty/md5.c:204: undefined reference to `__stack_smash_handler' > collect2: ld returned 1 exit status > make[3]: *** [cc1] Error 1 > make[3]: Leaving directory `/data/build/tmp/gcc-build/gcc' > make[2]: *** [stage2_build] Error 2 > make[2]: Leaving directory `/data/build/tmp/gcc-build/gcc' > make[1]: *** [bootstrap] Error 2 > make[1]: Leaving directory `/data/build/tmp/gcc-build' > ERROR > /data/build/scripts/gcc build failed > make: *** [build] Error 1 > Use a clean LFS system. I did it this morning and the compile went through without any problems. cya Heiko |