Saqib Ali - 2002-05-10

Hi All,
Whenever I try to compile davfs it fails, I do:

# ./configure --with-kernel=/usr/src/linux-2.4.7-10
# make

and I get the following error message:

Making all in davfs
make[2]: Entering directory `/home/saqib/davfs-0.2.4/davfs'
gcc   -c -o inode.o -O3 -Wall -DMODULE -D__KERNEL__ -DLINUX -fomit-frame-pointer -I/usr/src/linux-2.4.7-10/include inode.c
inode.c:622: parse error before string constant
inode.c:622: warning: type defaults to `int' in declaration of `MODULE_LICENSE'
inode.c:622: warning: data definition has no type or storage class
make[2]: *** [inode.o] Error 1
make[2]: Leaving directory `/home/saqib/davfs-0.2.4/davfs'
make[1]: *** [all-recursive] Error 1
make[1]: Leaving directory `/home/saqib/davfs-0.2.4'
make: *** [all-recursive-am] Error 2

Please help.

Thanks
Saqib Ali