#78 Build fail on OSX

closed-fixed
None
5
2012-12-29
2012-12-29
No

While compiling on my Max OSX machine (10.8.2) I'm getting this kind of error:

gcc -DHAVE_CONFIG_H -I. -I.. -g -O2 -MT build.o -MD -MP -MF .deps/build.Tpo -c -o build.o build.c
In file included from build.c:50:
/usr/include/ncurses.h:539:40: error: macro "cbreak" passed 1 arguments, but takes just 0
/usr/include/ncurses.h:564:44: error: macro "erasechar" passed 1 arguments, but takes just 0
/usr/include/ncurses.h:600:43: error: macro "killchar" passed 1 arguments, but takes just 0
make[2]: *** [build.o] Error 1
make[1]: *** [all-recursive] Error 1
make: *** [all] Error 2

I've resolved and I'm attaching you my patch for the fix.

Regards,
Diego

Discussion

  • Diego Stamigni

    Diego Stamigni - 2012-12-29

    Patch for the fix I mentioned

     
  • Hans-Bernhard Broeker

    • assigned_to: nobody --> broeker
     
  • Hans-Bernhard Broeker

    This is not really a support request, it's a proposed patch. Moving to Patches

     
  • Diego Stamigni

    Diego Stamigni - 2012-12-29
    • status: open --> open-fixed
     
  • Hans-Bernhard Broeker

    Applied #2912267 instead.

     
  • Hans-Bernhard Broeker

    • status: open-fixed --> closed-fixed
     

Log in to post a comment.

Get latest updates about Open Source Projects, Conferences and News.

Sign up for the SourceForge newsletter:





No, thanks