Dejan Ursic - 2009-07-27

Hello,
I've got a huge problem. I tried to install cppunit version 1.12.1 on my computer. "Configure" and "make" runs fine, but when I run "make check" I receive the following output:

$ make check
Making check in src
make[1]: Entering directory `/cygdrive/c/Entwicklungsumgebung/cppunit-1.12.1/src'
Making check in cppunit
make[2]: Entering directory `/cygdrive/c/Entwicklungsumgebung/cppunit-1.12.1/src/cppunit'
make[2]: Nothing to be done for `check'.
make[2]: Leaving directory `/cygdrive/c/Entwicklungsumgebung/cppunit-1.12.1/src/cppunit'
Making check in DllPlugInTester
make[2]: Entering directory `/cygdrive/c/Entwicklungsumgebung/cppunit-1.12.1/src/DllPlugInTester'
make  DllPlugInTesterTest.exe
make[3]: Entering directory `/cygdrive/c/Entwicklungsumgebung/cppunit-1.12.1/src/DllPlugInTester'
make[3]: `DllPlugInTesterTest.exe' is up to date.
make[3]: Leaving directory `/cygdrive/c/Entwicklungsumgebung/cppunit-1.12.1/src/DllPlugInTester'
make  check-TESTS
make[3]: Entering directory `/cygdrive/c/Entwicklungsumgebung/cppunit-1.12.1/src/DllPlugInTester'
..../bin/sh: line 1:  2892 Aborted                 (core dumped) ${dir}$tst
FAIL: DllPlugInTesterTest
===================
1 of 1 tests failed
===================
make[3]: *** [check-TESTS] Error 1
make[3]: Leaving directory `/cygdrive/c/Entwicklungsumgebung/cppunit-1.12.1/src/DllPlugInTester'
make[2]: *** [check-am] Error 2
make[2]: Leaving directory `/cygdrive/c/Entwicklungsumgebung/cppunit-1.12.1/src/DllPlugInTester'
make[1]: *** [check-recursive] Error 1
make[1]: Leaving directory `/cygdrive/c/Entwicklungsumgebung/cppunit-1.12.1/src'
make: *** [check-recursive] Error 1

Do somebody know this problem? What can I do?

Thank you.