#453 make check fails on i686-apple-darwin

build problems
closed-out-of-date
ffcall (13)
5
2008-03-25
2008-03-25
No

Trying to build ffcall on Mac OS X 10.4.11/Intel, gcc 4.0.1, ./configure && make runs to completion, but "make check" fails with an Illegal instruction:

$ make check
cd avcall; make check
./minitests > minitests.out
LC_ALL=C uniq -u < minitests.out > minitests.output.i686-apple-darwin8.11.1
test '!' -s minitests.output.i686-apple-darwin8.11.1
cd vacall; make check
./minitests > minitests.out
LC_ALL=C uniq -u < minitests.out > minitests.output.i686-apple-darwin8.11.1
test '!' -s minitests.output.i686-apple-darwin8.11.1
cd trampoline; make check
./test1
Works, test1 passed.
./test2
test2 passed.
touch tests.passed.i686-apple-darwin8.11.1
cd callback; make check
cd vacall_r; make all
make[2]: Nothing to be done for `all'.
cd trampoline_r; make all
make[2]: Nothing to be done for `all'.
cd vacall_r; make check
make[2]: Nothing to be done for `check'.
cd trampoline_r; make check
./test1
make[2]: *** [check] Illegal instruction
make[1]: *** [check-subdirs] Error 2
make: *** [check] Error 2

Discussion

  • Sam Steingold

    Sam Steingold - 2008-03-25
    • status: open --> closed-out-of-date
     

Log in to post a comment.

Get latest updates about Open Source Projects, Conferences and News.

Sign up for the SourceForge newsletter:





No, thanks