#3 compilation error (scons) cgkit-2.0.0alpha2

Bug
closed
nobody
None
5
2005-02-22
2005-02-18
Clive Crous
No

% scons
scons: Reading SConscript files ...
22 source files
scons: done reading SConscript files.
scons: Building targets ...
g++ -Iinclude -I/usr/local/include -I/usr/X11R6/include
-I/sw/i386_linux-2.0_glibc2/boost_cvs -c -o
obj/planegeom.o src/planegeom.cpp
In file included from include/trimeshgeom.h:32,
from src/planegeom.cpp:23:
include/proceduralslot.h: In constructor
`support3d::ProceduralSlot<T, C>::ProceduralSlot()':
include/proceduralslot.h:111: error:
`NO_INPUT_CONNECTIONS' undeclared (first use this function)
include/proceduralslot.h:111: error: (Each undeclared
identifier is reported only once for each function it
appears in.)
include/proceduralslot.h: In member function `virtual
void support3d::ProceduralSlot<T, C>::computeValue()':
include/proceduralslot.h:167: error: `value' undeclared
(first use this function)
scons: *** [obj/planegeom.o] Error 1
scons: building terminated because of errors.

=== Additional Information ===

--- g++ ---
% g++ -v
Using built-in specs.
Configured with: FreeBSD/i386 system compiler
Thread model: posix
gcc version 3.4.2 [FreeBSD] 20040728

--- scons ---
% scons -v
SCons by Steven Knight et al.:
script: v0.96.1.D001, 2004/08/23 09:55:29, by
knight on casablanca
engine: v0.96.1.D001, 2004/08/23 09:55:29, by
knight on casablanca
Copyright (c) 2001, 2002, 2003, 2004 The SCons Foundation

Discussion

  • Matthias Baas

    Matthias Baas - 2005-02-22

    Logged In: YES
    user_id=211477

    Fixed in cvs and will be available with alpha3.

     
  • Matthias Baas

    Matthias Baas - 2005-02-22
    • status: open --> closed
     

Log in to post a comment.