#227 make error

unexpected behavior
closed-rejected
3
2014-10-20
2009-10-27
No

make[5]: Wejście do katalogu
`/home/kubdat/rpm/BUILD/brlcad-7.14.8/src/other/incrTcl/itcl/generic'

/bin/sh ../../../../../libtool --silent --tag=CC --silent --mode=compile
gcc -DHAVE_CONFIG_H -I. -I../../../../../include
-I../../../../../src/other/tcl/generic -I../../../../../src/other/tcl/unix
-I../../../../../src/other/tcl/generic -I../../../../../src/other/tcl/unix
-O2 -g -pipe -Wformat -Werror=format-security -Wp,-D_FORTIFY_SOURCE=2
-fexceptions -fstack-protector --param=ssp-buffer-size=4
-I/usr/local/include -DBRLCADBUILD=1 -I../../../../../include
-I../../../../../src/other/openNURBS -I../../../../../src/other/libz -O2
-g -pipe -Wformat -Werror=format-security -Wp,-D_FORTIFY_SOURCE=2
-fexceptions -fstack-protector --param=ssp-buffer-size=4 -pipe
-fno-strict-aliasing -fno-common -fexceptions -m64 -g -O3 -c -o
itclStubLib.lo itclStubLib.c

/bin/sh ../../../../../libtool --silent --tag=CC --silent --mode=link gcc
-O2 -g -pipe -Wformat -Werror=format-security -Wp,-D_FORTIFY_SOURCE=2
-fexceptions -fstack-protector --param=ssp-buffer-size=4 -pipe
-fno-strict-aliasing -fno-common -fexceptions -m64 -g -O3
-L/usr/local/lib64 -L/usr/local/lib -pipe -fno-strict-aliasing -fno-common
-fexceptions -m64 -g -O3 -o libitclstub.la -rpath /usr/lib64 itclStubLib.lo

/bin/sh ../../../../../libtool --silent --tag=CC --silent --mode=link gcc
-O2 -g -pipe -Wformat -Werror=format-security -Wp,-D_FORTIFY_SOURCE=2
-fexceptions -fstack-protector --param=ssp-buffer-size=4 -pipe
-fno-strict-aliasing -fno-common -fexceptions -m64 -g -O3
-L/usr/local/lib64 -L/usr/local/lib -pipe -fno-strict-aliasing -fno-common
-fexceptions -m64 -g -O3 -o libitclstub3.4.la -rpath /usr/lib64
itclStubLib.lo

/bin/sh ../../../../../libtool --silent --tag=CC --silent --mode=compile
gcc -DHAVE_CONFIG_H -I. -I../../../../../include
-I../../../../../src/other/tcl/generic -I../../../../../src/other/tcl/unix
-I../../../../../src/other/tcl/generic -I../../../../../src/other/tcl/unix
-O2 -g -pipe -Wformat -Werror=format-security -Wp,-D_FORTIFY_SOURCE=2
-fexceptions -fstack-protector --param=ssp-buffer-size=4
-I/usr/local/include -DBRLCADBUILD=1 -I../../../../../include
-I../../../../../src/other/openNURBS -I../../../../../src/other/libz -O2
-g -pipe -Wformat -Werror=format-security -Wp,-D_FORTIFY_SOURCE=2
-fexceptions -fstack-protector --param=ssp-buffer-size=4 -pipe
-fno-strict-aliasing -fno-common -fexceptions -m64 -g -O3 -c -o
itclStubInit.lo itclStubInit.c

/bin/sh ../../../../../libtool --silent --tag=CC --silent --mode=compile
gcc -DHAVE_CONFIG_H -I. -I../../../../../include
-I../../../../../src/other/tcl/generic -I../../../../../src/other/tcl/unix
-I../../../../../src/other/tcl/generic -I../../../../../src/other/tcl/unix
-O2 -g -pipe -Wformat -Werror=format-security -Wp,-D_FORTIFY_SOURCE=2
-fexceptions -fstack-protector --param=ssp-buffer-size=4
-I/usr/local/include -DBRLCADBUILD=1 -I../../../../../include
-I../../../../../src/other/openNURBS -I../../../../../src/other/libz -O2
-g -pipe -Wformat -Werror=format-security -Wp,-D_FORTIFY_SOURCE=2
-fexceptions -fstack-protector --param=ssp-buffer-size=4 -pipe
-fno-strict-aliasing -fno-common -fexceptions -m64 -g -O3 -c -o
itcl_bicmds.lo itcl_bicmds.c

itcl_bicmds.c: In function ‘Itcl_BiInfoFunctionCmd’:

itcl_bicmds.c:1109: warning: passing argument 3 of
‘Tcl_GetIndexFromObj’ from incompatible pointer type

../../../../../src/other/tcl/generic/tclDecls.h:268: note: expected
‘const char * const*’ but argument is of type ‘char **’
itcl_bicmds.c: In function ‘Itcl_BiInfoVariableCmd’:

itcl_bicmds.c:1322: warning: passing argument 3 of
‘Tcl_GetIndexFromObj’ from incompatible pointer type

../../../../../src/other/tcl/generic/tclDecls.h:268: note: expected
‘const char * const*’ but argument is of type ‘char **’
itcl_bicmds.c: In function ‘Itcl_DefaultInfoCmd’:

itcl_bicmds.c:1695: error: ‘Tcl_Interp’ has no member named
‘result’
itcl_bicmds.c:1695: error: ‘Tcl_Interp’ has no member named
‘result’
itcl_bicmds.c:1695: error: ‘Tcl_Interp’ has no member named
‘result’
itcl_bicmds.c:1695: error: ‘Tcl_Interp’ has no member named
‘result’
itcl_bicmds.c:1695: error: ‘Tcl_Interp’ has no member named
‘result’
itcl_bicmds.c:1695: error: ‘Tcl_Interp’ has no member named
‘result’
itcl_bicmds.c:1695: error: ‘Tcl_Interp’ has no member named
‘result’
itcl_bicmds.c:1695: error: ‘Tcl_Interp’ has no member named
‘result’
itcl_bicmds.c:1695: error: ‘Tcl_Interp’ has no member named
‘result’
itcl_bicmds.c:1695: error: ‘Tcl_Interp’ has no member named
‘result’
itcl_bicmds.c:1695: error: ‘Tcl_Interp’ has no member named
‘result’
itcl_bicmds.c:1695: error: ‘Tcl_Interp’ has no member named
‘result’
itcl_bicmds.c:1695: error: ‘Tcl_Interp’ has no member named
‘result’
itcl_bicmds.c:1695: error: ‘Tcl_Interp’ has no member named
‘result’
itcl_bicmds.c:1695: error: ‘Tcl_Interp’ has no member named
‘result’
itcl_bicmds.c:1695: error: ‘Tcl_Interp’ has no member named
‘result’
itcl_bicmds.c:1695: error: ‘Tcl_Interp’ has no member named
‘result’
itcl_bicmds.c:1695: error: ‘Tcl_Interp’ has no member named
‘result’
itcl_bicmds.c:1695: error: ‘Tcl_Interp’ has no member named
‘result’
itcl_bicmds.c:1695: error: ‘Tcl_Interp’ has no member named
‘result’
itcl_bicmds.c:1695: error: ‘Tcl_Interp’ has no member named
‘result’
itcl_bicmds.c:1695: error: ‘Tcl_Interp’ has no member named
‘result’
itcl_bicmds.c:1695: error: ‘Tcl_Interp’ has no member named
‘result’
make[5]: *** [itcl_bicmds.lo] Błąd 1
make[5]: Opuszczenie katalogu
`/home/kubdat/rpm/BUILD/brlcad-7.14.8/src/other/incrTcl/itcl/generic'
make[4]: *** [all-recursive] Błąd 1
make[4]: Opuszczenie katalogu
`/home/kubdat/rpm/BUILD/brlcad-7.14.8/src/other/incrTcl/itcl'
make[3]: *** [all-recursive] Błąd 1
make[3]: Opuszczenie katalogu
`/home/kubdat/rpm/BUILD/brlcad-7.14.8/src/other/incrTcl'
make[2]: *** [all-recursive] Błąd 1
make[2]: Opuszczenie katalogu
`/home/kubdat/rpm/BUILD/brlcad-7.14.8/src/other'
make[1]: *** [all-recursive] Błąd 1
make[1]: Opuszczenie katalogu `/home/kubdat/rpm/BUILD/brlcad-7.14.8/src'
make: *** [all-recursive] Błąd 1
błąd: Błędny stan wyjścia z /home/kubdat/rpm/tmp/rpm-tmp.O46cqc
(%build)

ideas? thx

Discussion

  • Sean Morrison

    Sean Morrison - 2009-10-27

    Please provide your config.log file. It looks like an incompatibility between a system-installed version of Tcl and the Incrtcl it's trying to compile.

    The solution is to either --enable-all during configure or install Incrtcl manually so that configure will detect it.

     
  • Sean Morrison

    Sean Morrison - 2009-10-27
    • milestone: --> unexpected behavior
    • priority: 5 --> 3
    • assigned_to: nobody --> brlcad
    • status: open --> pending-rejected
     
  • Marek Walczak

    Marek Walczak - 2009-10-27

    build section:

    %build
    ./autogen.sh

    ./configure \ %ifarch x86_64
    --enable-64bit \ %endif
    --prefix=%{_prefix} \ --libdir=%{_libdir} \ --mandir=/usr/share/man \ --with-gl-library=%{_libdir} \ --with-tcl=%{_libdir} \ --with-tk=%{_libdir} \ --with-cppflags="%optflags" \ --with-cxxflags="%optflags" \ --with-cflags="%optflags" \ --with-ogl \ --enable-all \ --enable-adrt-build \ --enable-optimized \ --enable-static \ --enable-documentation

    %__make
    #############
    tcl:

    [kubdat@localhost SPECS]$ rpm -qa|grep tcl
    tcl-8.6-0.b1.2mdv2010.0
    lib64itclib0-devel-1.1.2-9mdk
    lib64tcl-devel-8.6-0.b1.2mdv2010.0
    itcl-3.4b1-69.1mib2010.0
    lib64itclib0-1.1.2-9mdk
    lib64qassistantclient1-3.3.8b-16mdv2010.0
    lib64qtclucene4-4.5.3-2mdv2010.0
    itcl-devel-3.4b1-69.1mib2010.0
    lib64tcl8.6-8.6-0.b1.2mdv2010.0
    [kubdat@localhost SPECS]$
    ###########
    bug:

    /bin/sh ../../../../../libtool --silent --tag=CC --silent --mode=compile gcc -DHAVE_CONFIG_H -I. -I../../../../../include -I../../../../../src/other/tcl/generic -I../../../../../src/other/tcl/unix -I../../../../../src/other/tcl/generic -I../../../../../src/other/tcl/unix -O2 -g -pipe -Wformat -Werror=format-security -Wp,-D_FORTIFY_SOURCE=2 -fexceptions -fstack-protector --param=ssp-buffer-size=4 -I/usr/local/include -DBRLCADBUILD=1 -I../../../../../include -I../../../../../src/other/openNURBS -I../../../../../src/other/libz -O2 -g -pipe -Wformat -Werror=format-security -Wp,-D_FORTIFY_SOURCE=2 -fexceptions -fstack-protector --param=ssp-buffer-size=4 -pipe -fno-strict-aliasing -fno-common -fexceptions -m64 -g -O3 -c -o itcl_bicmds.lo itcl_bicmds.c
    itcl_bicmds.c: In function ‘Itcl_BiInfoFunctionCmd’:
    itcl_bicmds.c:1109: warning: passing argument 3 of ‘Tcl_GetIndexFromObj’ from incompatible pointer type
    ../../../../../src/other/tcl/generic/tclDecls.h:268: note: expected ‘const char * const*’ but argument is of type ‘char **’
    itcl_bicmds.c: In function ‘Itcl_BiInfoVariableCmd’:
    itcl_bicmds.c:1322: warning: passing argument 3 of ‘Tcl_GetIndexFromObj’ from incompatible pointer type
    ../../../../../src/other/tcl/generic/tclDecls.h:268: note: expected ‘const char * const*’ but argument is of type ‘char **’
    itcl_bicmds.c: In function ‘Itcl_DefaultInfoCmd’:
    itcl_bicmds.c:1695: error: ‘Tcl_Interp’ has no member named ‘result’
    itcl_bicmds.c:1695: error: ‘Tcl_Interp’ has no member named ‘result’
    itcl_bicmds.c:1695: error: ‘Tcl_Interp’ has no member named ‘result’
    itcl_bicmds.c:1695: error: ‘Tcl_Interp’ has no member named ‘result’
    itcl_bicmds.c:1695: error: ‘Tcl_Interp’ has no member named ‘result’
    itcl_bicmds.c:1695: error: ‘Tcl_Interp’ has no member named ‘result’
    itcl_bicmds.c:1695: error: ‘Tcl_Interp’ has no member named ‘result’
    itcl_bicmds.c:1695: error: ‘Tcl_Interp’ has no member named ‘result’
    itcl_bicmds.c:1695: error: ‘Tcl_Interp’ has no member named ‘result’
    itcl_bicmds.c:1695: error: ‘Tcl_Interp’ has no member named ‘result’
    itcl_bicmds.c:1695: error: ‘Tcl_Interp’ has no member named ‘result’
    itcl_bicmds.c:1695: error: ‘Tcl_Interp’ has no member named ‘result’
    itcl_bicmds.c:1695: error: ‘Tcl_Interp’ has no member named ‘result’
    itcl_bicmds.c:1695: error: ‘Tcl_Interp’ has no member named ‘result’
    itcl_bicmds.c:1695: error: ‘Tcl_Interp’ has no member named ‘result’
    itcl_bicmds.c:1695: error: ‘Tcl_Interp’ has no member named ‘result’
    itcl_bicmds.c:1695: error: ‘Tcl_Interp’ has no member named ‘result’
    itcl_bicmds.c:1695: error: ‘Tcl_Interp’ has no member named ‘result’
    itcl_bicmds.c:1695: error: ‘Tcl_Interp’ has no member named ‘result’
    itcl_bicmds.c:1695: error: ‘Tcl_Interp’ has no member named ‘result’
    itcl_bicmds.c:1695: error: ‘Tcl_Interp’ has no member named ‘result’
    itcl_bicmds.c:1695: error: ‘Tcl_Interp’ has no member named ‘result’
    itcl_bicmds.c:1695: error: ‘Tcl_Interp’ has no member named ‘result’
    make[5]: *** [itcl_bicmds.lo] Błąd 1
    make[5]: Opuszczenie katalogu `/home/kubdat/rpm/BUILD/brlcad-7.16.0/src/other/incrTcl/itcl/generic'
    make[4]: *** [all-recursive] Błąd 1
    make[4]: Opuszczenie katalogu `/home/kubdat/rpm/BUILD/brlcad-7.16.0/src/other/incrTcl/itcl'
    make[3]: *** [all-recursive] Błąd 1
    make[3]: Opuszczenie katalogu `/home/kubdat/rpm/BUILD/brlcad-7.16.0/src/other/incrTcl'
    make[2]: *** [all-recursive] Błąd 1
    make[2]: Opuszczenie katalogu `/home/kubdat/rpm/BUILD/brlcad-7.16.0/src/other'
    make[1]: *** [all-recursive] Błąd 1
    make[1]: Opuszczenie katalogu `/home/kubdat/rpm/BUILD/brlcad-7.16.0/src'
    make: *** [all-recursive] Błąd 1
    błąd: Błędny stan wyjścia z /home/kubdat/rpm/tmp/rpm-tmp.ZKWGFR (%build)

    ??

     
  • SourceForge Robot

    This Tracker item was closed automatically by the system. It was
    previously set to a Pending status, and the original submitter
    did not respond within 14 days (the time period specified by
    the administrator of this Tracker).

     
  • SourceForge Robot

    • status: pending-rejected --> closed-rejected
     

Log in to post a comment.

Get latest updates about Open Source Projects, Conferences and News.

Sign up for the SourceForge newsletter:

JavaScript is required for this form.





No, thanks