#333 Declaration error

open
nobody
5
2010-11-04
2010-11-04
Anonymous
No

Compiling Blackbox 0.70.1 with gcc 4.4.4 under Imaginos 210.03 (Slackware based) gave the following error report

Image.cc: In member function 'void bt::Image::hgradient(const bt::Color&, const bt::Color&, bool)':
Image.cc:1350: error: 'memcpy' was not declared in this scope
make[2]: *** [Image.lo] Error 1
make[1]: *** [all-recursive] Error 1
make: *** [all] Error 2

Discussion


Log in to post a comment.

Get latest updates about Open Source Projects, Conferences and News.

Sign up for the SourceForge newsletter:





No, thanks