#4 0.40 can't install on Redhat 9

closed
nobody
5
2003-09-09
2003-09-03
KOH Wei Han
No

System: Redhat 9

Failed during make (bz2 installation, rpm doesn't work for me):

make all-recursive
make[1]: Entering directory `/bin/ayttm-0.4.0'
Making all in pixmaps
make[2]: Entering directory `/bin/ayttm-0.4.0/pixmaps'
make[2]: Nothing to be done for `all'.
make[2]: Leaving directory `/bin/ayttm-0.4.0/pixmaps'
Making all in po
make[2]: Entering directory `/bin/ayttm-0.4.0/po'
make[2]: Nothing to be done for `all'.
make[2]: Leaving directory `/bin/ayttm-0.4.0/po'
Making all in m4
make[2]: Entering directory `/bin/ayttm-0.4.0/m4'
make[2]: Nothing to be done for `all'.
make[2]: Leaving directory `/bin/ayttm-0.4.0/m4'
Making all in intl
make[2]: Entering directory `/bin/ayttm-0.4.0/intl'
make[2]: Nothing to be done for `all'.
make[2]: Leaving directory `/bin/ayttm-0.4.0/intl'
Making all in libproxy
make[2]: Entering directory `/bin/ayttm-0.4.0/libproxy'
make[2]: Nothing to be done for `all'.
make[2]: Leaving directory `/bin/ayttm-0.4.0/libproxy'
Making all in sounds
make[2]: Entering directory `/bin/ayttm-0.4.0/sounds'
make[2]: Nothing to be done for `all'.
make[2]: Leaving directory `/bin/ayttm-0.4.0/sounds'
Making all in doc
make[2]: Entering directory `/bin/ayttm-0.4.0/doc'
make[2]: Nothing to be done for `all'.
make[2]: Leaving directory `/bin/ayttm-0.4.0/doc'
Making all in src
make[2]: Entering directory `/bin/ayttm-0.4.0/src'
make all-recursive
make[3]: Entering directory `/bin/ayttm-0.4.0/src'
Making all in gtk
make[4]: Entering directory `/bin/ayttm-0.4.0/src/gtk'
make[4]: Nothing to be done for `all'.
make[4]: Leaving directory `/bin/ayttm-0.4.0/src/gtk'
make[4]: Entering directory `/bin/ayttm-0.4.0/src'
if gcc -DHAVE_CONFIG_H -DLOCALEDIR=\"/usr/local/share/locale\"
-D_REENTRANT -I. -I. -I.. -I/usr/include/glib-1.2
-I/usr/lib/glib/include -I/usr/include/gtk-1.2 -I/usr/include/glib-1.2
-I/usr/lib/glib/include -I/usr/X11R6/include -I.. -I../libproxy -g -O2 -I..
/src -MT ssl.o -MD -MP -MF ".deps/ssl.Tpo" \ -c -o ssl.o `test -f 'ssl.c' || echo './'`ssl.c; \ then mv ".deps/ssl.Tpo" ".deps/ssl.Po"; \ else rm -f ".deps/ssl.Tpo"; exit 1; \ fi
In file included from /usr/include/openssl/ssl.h:179,
from ssl.h:31,
from ssl.c:28:
/usr/include/openssl/kssl.h:72:18: krb5.h: No such file or directory
In file included from /usr/include/openssl/ssl.h:179,
from ssl.h:31,
from ssl.c:28:
/usr/include/openssl/kssl.h:132: parse error before "krb5_enctype"
/usr/include/openssl/kssl.h:134: parse error before "FAR"
/usr/include/openssl/kssl.h:135: parse error before '}' token
/usr/include/openssl/kssl.h:147: parse error before
"kssl_ctx_setstring"
/usr/include/openssl/kssl.h:147: parse error before '*' token
/usr/include/openssl/kssl.h:148: parse error before '*' token
/usr/include/openssl/kssl.h:149: parse error before '*' token
/usr/include/openssl/kssl.h:149: parse error before '*' token
/usr/include/openssl/kssl.h:150: parse error before '*' token
/usr/include/openssl/kssl.h:151: parse error before "kssl_ctx_setprinc"
/usr/include/openssl/kssl.h:151: parse error before '*' token
/usr/include/openssl/kssl.h:153: parse error before "kssl_cget_tkt"
/usr/include/openssl/kssl.h:153: parse error before '*' token
/usr/include/openssl/kssl.h:155: parse error before "kssl_sget_tkt"
/usr/include/openssl/kssl.h:155: parse error before '*' token
/usr/include/openssl/kssl.h:157: parse error before "kssl_ctx_setkey"
/usr/include/openssl/kssl.h:157: parse error before '*' token
/usr/include/openssl/kssl.h:159: parse error before "context"
/usr/include/openssl/kssl.h:160: parse error before
"kssl_build_principal_2"
/usr/include/openssl/kssl.h:160: parse error before "context"
/usr/include/openssl/kssl.h:163: parse error before
"kssl_validate_times"
/usr/include/openssl/kssl.h:163: parse error before "atime"
/usr/include/openssl/kssl.h:165: parse error before
"kssl_check_authent"
/usr/include/openssl/kssl.h:165: parse error before '*' token
/usr/include/openssl/kssl.h:167: parse error before "enctype"
In file included from ssl.h:31,
from ssl.c:28:
/usr/include/openssl/ssl.h:909: parse error before "KSSL_CTX"
/usr/include/openssl/ssl.h:931: parse error before '}' token
make[4]: *** [ssl.o] Error 1
make[4]: Leaving directory `/bin/ayttm-0.4.0/src'
make[3]: *** [all-recursive] Error 1
make[3]: Leaving directory `/bin/ayttm-0.4.0/src'
make[2]: *** [all] Error 2
make[2]: Leaving directory `/bin/ayttm-0.4.0/src'
make[1]: *** [all-recursive] Error 1
make[1]: Leaving directory `/bin/ayttm-0.4.0'
make: *** [all] Error 2

Discussion

  • Nobody/Anonymous

    Logged In: NO

    this has been fixed in CVS version. You may get it with:
    cvs -z3 -d:pserver:anonymous@cvs.sf.net:/cvsroot/ayttm co ayttm

    hth,
    Colin

     
  • Nobody/Anonymous

    Logged In: NO

    This very thing happened to me. I have not seen any news on
    this.

     
  • Nobody/Anonymous

    Logged In: NO

    Until I checked Colins comments 2 seconds later OOOPS ;-)))

     
  • Colin Leroy

    Colin Leroy - 2003-09-09
    • status: open --> closed
     

Get latest updates about Open Source Projects, Conferences and News.

Sign up for the SourceForge newsletter:





No, thanks