error during make of ariannexp

Developers
2006-06-01
2013-06-06
  • Nobody/Anonymous

    I am trying to build ariannexp.  However, I am getting the following errors.  Can anybody help?

    make  all-recursive
    make[1]: Entering directory `/home/mmiller/arianne/ariannexp'
    Making all in libClient
    make[2]: Entering directory `/home/mmiller/arianne/ariannexp/libClient'
    make[2]: Nothing to be done for `all'.
    make[2]: Leaving directory `/home/mmiller/arianne/ariannexp/libClient'
    Making all in libFramework
    make[2]: Entering directory `/home/mmiller/arianne/ariannexp/libFramework'
    Making all in pyarianne
    make[3]: Entering directory `/home/mmiller/arianne/ariannexp/libFramework/pyarianne'
    make[3]: Nothing to be done for `all'.
    make[3]: Leaving directory `/home/mmiller/arianne/ariannexp/libFramework/pyarianne'
    make[3]: Entering directory `/home/mmiller/arianne/ariannexp/libFramework'
    if g++ -DHAVE_CONFIG_H -I. -I. -I..    -shared -I/usr/include/SDL -D_REENTRANT -I/usr/include/python2.4 -g -O2 -MT arianne_wrap_python.o -MD -MP -MF ".deps/arianne_wrap_python.Tpo" -c -o arianne_wrap_python.o arianne_wrap_python.cpp; \ then mv -f ".deps/arianne_wrap_python.Tpo" ".deps/arianne_wrap_python.Po"; else rm -f ".deps/arianne_wrap_python.Tpo"; exit 1; fi
    arianne_wrap_python.cpp: In function ‘bool swig::check(PyObject*) [with Type = std::pair<Uint32, arianne::RPObject>]’:
    arianne_wrap_python.cpp:2188:   instantiated from ‘bool swig::PySequence_Cont<T>::check(bool) const [with T = std::pair<Uint32, arianne::RPObject>]’
    arianne_wrap_python.cpp:2238:   instantiated from ‘static int swig::traits_asptr_stdseq<Seq, T>::asptr(PyObject*, Seq**) [with Seq = std::map<Uint32, arianne::RPObject, std::less<Uint32>, std::allocator<std::pair<const Uint32, arianne::RPObject> > >, T = std::pair<Uint32, arianne::RPObject>]’
    arianne_wrap_python.cpp:2682:   instantiated from ‘static int swig::traits_asptr<std::map<K, T, std::less<_Key>, std::allocator<std::pair<const _Key, _Tp> > > >::asptr(PyObject*, std::map<K, T, std::less<_Key>, std::allocator<std::pair<const _Key, _Tp> > >**) [with K = Uint32, T = arianne::RPObject]’
    arianne_wrap_python.cpp:1726:   instantiated from ‘int swig::asptr(PyObject*, Type**) [with Type = std::map<Uint32, arianne::RPObject, std::less<Uint32>, std::allocator<std::pair<const Uint32, arianne::RPObject> > >]’
    arianne_wrap_python.cpp:5999:   instantiated from here
    arianne_wrap_python.cpp:1850: error: no type named ‘category’ in ‘struct swig::traits<std::pair<Uint32, arianne::RPObject> >’
    arianne_wrap_python.cpp:1850: error: ‘check’ is not a member of ‘<declaration error>’
    arianne_wrap_python.cpp: In function ‘const char* swig::type_name() [with Type = std::pair<Uint32, arianne::RPObject>]’:
    arianne_wrap_python.cpp:2192:   instantiated from ‘bool swig::PySequence_Cont<T>::check(bool) const [with T = std::pair<Uint32, arianne::RPObject>]’
    arianne_wrap_python.cpp:2238:   instantiated from ‘static int swig::traits_asptr_stdseq<Seq, T>::asptr(PyObject*, Seq**) [with Seq = std::map<Uint32, arianne::RPObject, std::less<Uint32>, std::allocator<std::pair<const Uint32, arianne::RPObject> > >, T = std::pair<Uint32, arianne::RPObject>]’
    arianne_wrap_python.cpp:2682:   instantiated from ‘static int swig::traits_asptr<std::map<K, T, std::less<_Key>, std::allocator<std::pair<const _Key, _Tp> > > >::asptr(PyObject*, std::map<K, T, std::less<_Key>, std::allocator<std::pair<const _Key, _Tp> > >**) [with K = Uint32, T = arianne::RPObject]’
    arianne_wrap_python.cpp:1726:   instantiated from ‘int swig::asptr(PyObject*, Type**) [with Type = std::map<Uint32, arianne::RPObject, std::less<Uint32>, std::allocator<std::pair<const Uint32, arianne::RPObject> > >]’
    arianne_wrap_python.cpp:5999:   instantiated from here
    arianne_wrap_python.cpp:1627: error: ‘type_name’ is not a member of ‘swig::traits<std::pair<Uint32, arianne::RPObject> >’
    arianne_wrap_python.cpp: In function ‘const char* swig::type_name() [with Type = Uint32]’:
    arianne_wrap_python.cpp:1637:   instantiated from ‘static swig_type_info* swig::traits_info<Type>::type_info() [with Type = Uint32]’
    arianne_wrap_python.cpp:1644:   instantiated from ‘swig_type_info* swig::type_info() [with Type = Uint32]’
    arianne_wrap_python.cpp:1678:   instantiated from ‘static PyObject* swig::traits_from_ptr<Type>::from(Type*, int) [with Type = Uint32]’
    arianne_wrap_python.cpp:1684:   instantiated from ‘static PyObject* swig::traits_from<Type>::from(const Type&) [with Type = Uint32]’
    arianne_wrap_python.cpp:1696:   instantiated from ‘PyObject* swig::from(const Type&) [with Type = Uint32]’
    arianne_wrap_python.cpp:2815:   instantiated from here
    arianne_wrap_python.cpp:1627: error: ‘type_name’ is not a member of ‘swig::traits<Uint32>’
    arianne_wrap_python.cpp: In function ‘const char* swig::type_name() [with Type = std::pair<const Uint32, arianne::RPObject>]’:
    arianne_wrap_python.cpp:1637:   instantiated from ‘static swig_type_info* swig::traits_info<Type>::type_info() [with Type = std::pair<const Uint32, arianne::RPObject>]’
    arianne_wrap_python.cpp:1644:   instantiated from ‘swig_type_info* swig::type_info() [with Type = std::pair<const Uint32, arianne::RPObject>]’
    arianne_wrap_python.cpp:1678:   instantiated from ‘static PyObject* swig::traits_from_ptr<Type>::from(Type*, int) [with Type = std::pair<const Uint32, arianne::RPObject>]’
    arianne_wrap_python.cpp:1684:   instantiated from ‘static PyObject* swig::traits_from<Type>::from(const Type&) [with Type = std::pair<const Uint32, arianne::RPObject>]’
    arianne_wrap_python.cpp:1696:   instantiated from ‘PyObject* swig::from(const Type&) [with Type = std::pair<const Uint32, arianne::RPObject>]’
    arianne_wrap_python.cpp:2847:   instantiated from here
    arianne_wrap_python.cpp:1627: error: ‘type_name’ is not a member of ‘swig::traits<std::pair<const Uint32, arianne::RPObject> >’
    arianne_wrap_python.cpp: In function ‘Type swig::as(PyObject*, bool) [with Type = std::pair<Uint32, arianne::RPObject>]’:
    arianne_wrap_python.cpp:1994:   instantiated from ‘swig::PySequence_Ref<T>::operator T() const [with T = std::pair<Uint32, arianne::RPObject>]’
    arianne_wrap_python.cpp:2053:   instantiated from ‘swig::PySequence_ArrowProxy<T> swig::PySequence_Iter<T, Reference>::operator->() const [with T = std::pair<Uint32, arianne::RPObject>, Reference = const swig::PySequence_Ref<std::pair<Uint32, arianne::RPObject> >]’
    arianne_wrap_python.cpp:2671:   instantiated from ‘void swig::assign(const PySeq&, std::map<K, T, std::less<K>, std::allocator<std::pair<const K, T> > >*) [with PySeq = swig::PySequence_Cont<std::pair<Uint32, arianne::RPObject> >, K = Uint32, T = arianne::RPObject]’
    arianne_wrap_python.cpp:2234:   instantiated from ‘static int swig::traits_asptr_stdseq<Seq, T>::asptr(PyObject*, Seq**) [with Seq = std::map<Uint32, arianne::RPObject, std::less<Uint32>, std::allocator<std::pair<const Uint32, arianne::RPObject> > >, T = std::pair<Uint32, arianne::RPObject>]’
    arianne_wrap_python.cpp:2682:   instantiated from ‘static int swig::traits_asptr<std::map<K, T, std::less<_Key>, std::allocator<std::pair<const _Key, _Tp> > > >::asptr(PyObject*, std::map<K, T, std::less<_Key>, std::allocator<std::pair<const _Key, _Tp> > >**) [with K = Uint32, T = arianne::RPObject]’
    arianne_wrap_python.cpp:1726:   instantiated from ‘int swig::asptr(PyObject*, Type**) [with Type = std::map<Uint32, arianne::RPObject, std::less<Uint32>, std::allocator<std::pair<const Uint32, arianne::RPObject> > >]’
    arianne_wrap_python.cpp:5999:   instantiated from here
    arianne_wrap_python.cpp:1831: error: no type named ‘category’ in ‘struct swig::traits<std::pair<Uint32, arianne::RPObject> >’
    arianne_wrap_python.cpp:1831: error: ‘as’ is not a member of ‘<declaration error>’
    make[3]: *** [arianne_wrap_python.o] Error 1
    make[3]: Leaving directory `/home/mmiller/arianne/ariannexp/libFramework'
    make[2]: *** [all-recursive] Error 1
    make[2]: Leaving directory `/home/mmiller/arianne/ariannexp/libFramework'
    make[1]: *** [all-recursive] Error 1
    make[1]: Leaving directory `/home/mmiller/arianne/ariannexp'
    make: *** [all] Error 2

     
    • Nobody/Anonymous

      BAH!  Same problem I'm having.

       


Anonymous

Cancel  Add attachments





Get latest updates about Open Source Projects, Conferences and News.

Sign up for the SourceForge newsletter:

JavaScript is required for this form.





No, thanks