Somehow, the compilewithwalls task is breaking the build.  I first noticed it after I made a bug fix in verifydesign(which is not really related to compilewithwalls at all).  Compilewithwalls was not changed at all.  At first, I thought it was because of the names of classes being TestXXXX so I changed them to TrialXXX.

Now it says "Null Test: Caused an error" which makes no sense.  I have never seen anything like that before.
Thanks for any info,
dean

-----Original Message-----
From: Gump Integration Build [mailto:general@gump.apache.org]
Sent: Sunday, January 28, 2007 7:10 AM
To: ant-contrib-developers@lists.sourceforge.net
Subject: [Ant-contrib-developers] [GUMP@vmgump]: Project ant-contrib-test (in module ant-contrib) failed

To whom it may engage...
       
This is an automated request, but not an unsolicited one. For
more information please visit http://gump.apache.org/nagged.html,
and/or contact the folk at general@gump.apache.org.

Project ant-contrib-test has an issue affecting its community integration.
This issue affects 1 projects,
 and has been outstanding for 2 runs.
The current state of this project is 'Failed', with reason 'Build Failed'.
For reference only, the following projects are affected by this:
    - ant-contrib-test :  Useful little Ant tasks


Full details are available at:
    http://vmgump.apache.org/gump/public/ant-contrib/ant-contrib-test/index.html

That said, some information snippets are provided here.

The following annotations (debug/informational/warning/error messages) were provided:
 -INFO- Made directory [/usr/local/gump/public/workspace/ant-contrib/target/test-classes]
 -INFO- Failed with reason build failed



The following work was performed:
http://vmgump.apache.org/gump/public/ant-contrib/ant-contrib-test/gump_work/build_ant-contrib_ant-contrib-test.html
Work Name: build_ant-contrib_ant-contrib-test (Type: Build)
Work ended in a state of : Failed
Elapsed: 44 secs
Command Line: java -Djava.awt.headless=true -Xbootclasspath/p:/usr/local/gump/public/workspace/xml-commons/java/external/build/xml-apis.jar:/usr/local/gump/public/workspace/xml-xerces2/build/xercesImpl.jar org.apache.tools.ant.Main -Dgump.merge=/x1/gump/public/gump/work/merge.xml -Dbuild.sysclasspath=only -Djunit.jar.location=/usr/local/gump/packages/junit3.8.1/junit.jar -Dversion=28012007 -Dtestutil.jar.location=/usr/local/gump/public/workspace/ant/build/lib/ant-testutil.jar -Djar.name=ant-contrib-@@DATA@@.jar test

[Working Directory: /usr/local/gump/public/workspace/ant-contrib]
CLASSPATH: /opt/jdk1.5/lib/tools.jar:/usr/local/gump/public/workspace/ant-contrib/target/test-classes:/usr/local/gump/public/workspace/ant/dist/lib/ant-jmf.jar:/usr/local/gump/public/workspace/ant/dist/lib/ant-swing.jar:/usr/local/gump/public/workspace/ant/dist/lib/ant-apache-resolver.jar:/usr/local/gump/public/workspace/ant/dist/lib/ant-trax.jar:/usr/local/gump/public/workspace/ant/dist/lib/ant-junit.jar:/usr/local/gump/public/workspace/ant/dist/lib/ant-launcher.jar:/usr/local/gump/public/workspace/ant/dist/lib/ant-nodeps.jar:/usr/local/gump/public/workspace/ant/dist/lib/ant.jar:/usr/local/gump/packages/junit3.8.1/junit.jar:/usr/local/gump/public/workspace/xml-commons/java/build/resolver.jar:/usr/local/gump/public/workspace/xml-commons/java/external/build/xml-apis-ext.jar:/usr/local/gump/public/workspace/ant-contrib/target/ant-contrib-28012007.jar:/usr/local/gump/packages/bcel-5.2/bcel-5.2.jar:/usr/local/gump/public/workspace/ant-contrib/lib/ivy/jars/ivy-1.3.1.jar:/usr/local

 /gump/public/workspace/ant/build/lib/ant-testutil.jar
---------------------------------------------
    [junit]     at java.lang.ClassLoader.loadClassInternal(ClassLoader.java:319)
    [junit]     at java.lang.Class.forName0(Native Method)
    [junit]     at java.lang.Class.forName(Class.java:242)
    [junit]
    [junit]
    [junit] Test walls.testC.mod.TrialCModule FAILED
    [junit] Testsuite: walls.testC.mod.modA.TrialCModuleA
    [junit] Tests run: 1, Failures: 0, Errors: 1, Time elapsed: 0 sec
    [junit]
    [junit] Null Test:  Caused an ERROR
    [junit] walls.testC.mod.modA.TrialCModuleA
    [junit] java.lang.ClassNotFoundException: walls.testC.mod.modA.TrialCModuleA
    [junit]     at java.net.URLClassLoader$1.run(URLClassLoader.java:200)
    [junit]     at java.security.AccessController.doPrivileged(Native Method)
    [junit]     at java.net.URLClassLoader.findClass(URLClassLoader.java:188)
    [junit]     at java.lang.ClassLoader.loadClass(ClassLoader.java:306)
    [junit]     at sun.misc.Launcher$AppClassLoader.loadClass(Launcher.java:268)
    [junit]     at java.lang.ClassLoader.loadClass(ClassLoader.java:251)
    [junit]     at java.lang.ClassLoader.loadClass(ClassLoader.java:251)
    [junit]     at java.lang.ClassLoader.loadClassInternal(ClassLoader.java:319)
    [junit]     at java.lang.Class.forName0(Native Method)
    [junit]     at java.lang.Class.forName(Class.java:242)
    [junit]
    [junit]
    [junit] Test walls.testC.mod.modA.TrialCModuleA FAILED
    [junit] Testsuite: walls.testC.mod.modB.TrialCModuleB
    [junit] Tests run: 1, Failures: 0, Errors: 1, Time elapsed: 0 sec
    [junit]
    [junit] Null Test:  Caused an ERROR
    [junit] walls.testC.mod.modB.TrialCModuleB
    [junit] java.lang.ClassNotFoundException: walls.testC.mod.modB.TrialCModuleB
    [junit]     at java.net.URLClassLoader$1.run(URLClassLoader.java:200)
    [junit]     at java.security.AccessController.doPrivileged(Native Method)
    [junit]     at java.net.URLClassLoader.findClass(URLClassLoader.java:188)
    [junit]     at java.lang.ClassLoader.loadClass(ClassLoader.java:306)
    [junit]     at sun.misc.Launcher$AppClassLoader.loadClass(Launcher.java:268)
    [junit]     at java.lang.ClassLoader.loadClass(ClassLoader.java:251)
    [junit]     at java.lang.ClassLoader.loadClass(ClassLoader.java:251)
    [junit]     at java.lang.ClassLoader.loadClassInternal(ClassLoader.java:319)
    [junit]     at java.lang.Class.forName0(Native Method)
    [junit]     at java.lang.Class.forName(Class.java:242)
    [junit]
    [junit]
    [junit] Test walls.testC.mod.modB.TrialCModuleB FAILED

BUILD FAILED
/x1/gump/public/workspace/ant-contrib/build.xml:254: The following error occurred while executing this line:
/x1/gump/public/workspace/ant-contrib/build.xml:239: JUnit error (true) encountered.

Total time: 43 seconds
---------------------------------------------

To subscribe to this information via syndicated feeds:
- RSS: http://vmgump.apache.org/gump/public/ant-contrib/ant-contrib-test/rss.xml
- Atom: http://vmgump.apache.org/gump/public/ant-contrib/ant-contrib-test/atom.xml

============================== Gump Tracking Only ===
Produced by Gump version 2.2.
Gump Run 21000028012007, vmgump.apache.org:vmgump-public:21000028012007
Gump E-mail Identifier (unique within run) #36.

--
Apache Gump
http://gump.apache.org/ [Instance: vmgump]

-------------------------------------------------------------------------
Take Surveys. Earn Cash. Influence the Future of IT
Join SourceForge.net's Techsay panel and you'll get the chance to share your
opinions on IT & business topics through brief surveys - and earn cash
http://www.techsay.com/default.php?page=join.php&p=sourceforge&CID=DEVDEV
_______________________________________________
Ant-contrib-developers mailing list
Ant-contrib-developers@lists.sourceforge.net
https://lists.sourceforge.net/lists/listinfo/ant-contrib-developers