error when I make make ampd-0.9.8

Help
2007-09-13
2013-04-22
  • Nobody/Anonymous

    Hi

    I have a problem with install ampd

    All ok when i run ./configure

    When I start make then I became follow error

    ampdb_dump.c:136: error: incompatible type for argument 4 of db->open
    ampdb_dump.c:136: error: to many arguments to funtion db->open
    make[2]: *** [ampd_dump.o] Error 1

    What is the problem??

    in a test c file db_create() works

    Best thanks

     
    • Nobody/Anonymous

      ampdb_dump.c: In function `db_open':
      ampdb_dump.c:136: error: incompatible type for argument 4 of indirect function call
      ampdb_dump.c:136: error: too many arguments to function
      *** Error code 1

      I have the same problem on FreeBSD with a fresh install of Berkeley db4-4.0 after configure finishes with no error.

       

Log in to post a comment.