#7 doesn't compile

closed
None
5
2002-05-02
2002-05-02
No

/usr/bin/make
make[1]: Entering directory
`/home/nk/debian/airsnort/airsnort-0.2.1'
cd . && autoheader
/usr/bin/make all-recursive
make[2]: Entering directory
`/home/nk/debian/airsnort/airsnort-0.2.1'
Making all in macros
make[3]: Entering directory
`/home/nk/debian/airsnort/airsnort-0.2.1/macros'
make[3]: Nothing to be done for `all'.
make[3]: Leaving directory
`/home/nk/debian/airsnort/airsnort-0.2.1/macros'
Making all in src
make[3]: Entering directory
`/home/nk/debian/airsnort/airsnort-0.2.1/src'
gcc -DHAVE_CONFIG_H -I. -I. -I..
-I/usr/include/gnome-1.0 -DNEED_GNOMESUPPORT_H
-I/usr/lib/gnome-libs/include -I/usr/include/glib-1.2
-I/usr/lib/glib/include -I/usr/include/orbit-1.0
-I/usr/include/gtk-1.2 -I/usr/X11R6/include
-I/usr/include/gtk-1.2 -I/usr/include/glib-1.2
-I/usr/lib/glib/include -I/usr/X11R6/include -g -O2
-Wall -Wunused -Wmissing-prototypes
-Wmissing-declarations -c main.c
gcc -DHAVE_CONFIG_H -I. -I. -I..
-I/usr/include/gnome-1.0 -DNEED_GNOMESUPPORT_H
-I/usr/lib/gnome-libs/include -I/usr/include/glib-1.2
-I/usr/lib/glib/include -I/usr/include/orbit-1.0
-I/usr/include/gtk-1.2 -I/usr/X11R6/include
-I/usr/include/gtk-1.2 -I/usr/include/glib-1.2
-I/usr/lib/glib/include -I/usr/X11R6/include -g -O2
-Wall -Wunused -Wmissing-prototypes
-Wmissing-declarations -c support.c
gcc -DHAVE_CONFIG_H -I. -I. -I..
-I/usr/include/gnome-1.0 -DNEED_GNOMESUPPORT_H
-I/usr/lib/gnome-libs/include -I/usr/include/glib-1.2
-I/usr/lib/glib/include -I/usr/include/orbit-1.0
-I/usr/include/gtk-1.2 -I/usr/X11R6/include
-I/usr/include/gtk-1.2 -I/usr/include/glib-1.2
-I/usr/lib/glib/include -I/usr/X11R6/include -g -O2
-Wall -Wunused -Wmissing-prototypes
-Wmissing-declarations -c interface.c
gcc -DHAVE_CONFIG_H -I. -I. -I..
-I/usr/include/gnome-1.0 -DNEED_GNOMESUPPORT_H
-I/usr/lib/gnome-libs/include -I/usr/include/glib-1.2
-I/usr/lib/glib/include -I/usr/include/orbit-1.0
-I/usr/include/gtk-1.2 -I/usr/X11R6/include
-I/usr/include/gtk-1.2 -I/usr/include/glib-1.2
-I/usr/lib/glib/include -I/usr/X11R6/include -g -O2
-Wall -Wunused -Wmissing-prototypes
-Wmissing-declarations -c callbacks.c
callbacks.c:53: warning: no previous prototype for
`reallyQuit'
callbacks.c: In function `on_Start_clicked':
callbacks.c:198: `DLT_AIRONET_HEADER' undeclared (first
use in this function)
callbacks.c:198: (Each undeclared identifier is
reported only once
callbacks.c:198: for each function it appears in.)
callbacks.c: At top level:
callbacks.c:293: warning: no previous prototype for
`on_breadth40_show'
callbacks.c:301: warning: no previous prototype for
`on_breadth128_show'
make[3]: *** [callbacks.o] Error 1
make[3]: Leaving directory
`/home/nk/debian/airsnort/airsnort-0.2.1/src'
make[2]: *** [all-recursive] Error 1
make[2]: Leaving directory
`/home/nk/debian/airsnort/airsnort-0.2.1'
make[1]: *** [all-recursive-am] Error 2
make[1]: Leaving directory
`/home/nk/debian/airsnort/airsnort-0.2.1'
make: *** [build-stamp] Error 2

BTW: Why did you switched from ./configure;make to
./autogen.sh;make ?

Discussion

  • snacks snax

    snacks snax - 2002-05-02

    Logged In: YES
    user_id=466372

    You need to update your version of libpcap, which declares
    DLT_AIRONET_HEADER. Though that particular constant is not
    referred specifically, this problem is mentioned in the README.

    I did not switch away from ./configure, glade generates
    autogen.sh for automatic configuration. autogen.sh in turn
    generates configure. Airsnort 2.0 was identical and this is
    stated in the INSTALL file

     
  • snacks snax

    snacks snax - 2002-05-02
    • assigned_to: nobody --> snaks
    • status: open --> closed
     

Log in to post a comment.