CUDA GPU memtest

4.4 Stars (7)
101 Downloads (This Week)
Last Update:
Download cuda_memtest-1.2.3.tar.gz
Browse All Files

Description

A GPU memory test utility for NVIDIA and AMD GPUs using well established patterns from memtest86/memtest86+ as well as additional stress tests. The tests are designed to find hardware and soft errors. The code is written in CUDA and OpenCL.

CUDA GPU memtest Web Site

Categories

Linux

License

Other License

Features

  • bug fixes
  • opencl memory tests available for NVIDIA and AMD GPUs

KEEP ME UPDATED

User Ratings

★★★★★
★★★★
★★★
★★
6
0
0
0
1
ease 1 of 5 2 of 5 3 of 5 4 of 5 5 of 5 0 / 5
features 1 of 5 2 of 5 3 of 5 4 of 5 5 of 5 0 / 5
design 1 of 5 2 of 5 3 of 5 4 of 5 5 of 5 0 / 5
support 1 of 5 2 of 5 3 of 5 4 of 5 5 of 5 0 / 5
Write a Review

User Reviews

  • sepben
    1 of 5 2 of 5 3 of 5 4 of 5 5 of 5

    cannot compile GPU Memtest with Dev-CPP :( Compiler is saying: Compiler: Default compiler Building Makefile: "C:\Dev-Cpp\Makefile.win" Führt make... aus make.exe -f "C:\Dev-Cpp\Makefile.win" all g++.exe -c ../Temp/cuda_memtest-1.2.3/misc.cpp -o ../Temp/cuda_memtest-1.2.3/misc.o -I"C:/Dev-Cpp/lib/gcc/mingw32/3.4.2/include" -I"C:/Dev-Cpp/include/c++/3.4.2/backward" -I"C:/Dev-Cpp/include/c++/3.4.2/mingw32" -I"C:/Dev-Cpp/include/c++/3.4.2" -I"C:/Dev-Cpp/include" In file included from ../Temp/cuda_memtest-1.2.3/pthread.h:4, from ../Temp/cuda_memtest-1.2.3/cuda_memtest.h:45, from ../Temp/cuda_memtest-1.2.3/misc.cpp:4: ../Temp/cuda_memtest-1.2.3/sched.h:25: error: expected constructor, destructor, or type conversion before "int" ../Temp/cuda_memtest-1.2.3/sched.h:25: error: expected `,' or `;' before "int" In file included from ../Temp/cuda_memtest-1.2.3/pthread.h:5, from ../Temp/cuda_memtest-1.2.3/cuda_memtest.h:45, from ../Temp/cuda_memtest-1.2.3/misc.cpp:4: C:/Dev-Cpp/include/signal.h:46: error: expected constructor, destructor, or type conversion before "typedef" C:/Dev-Cpp/include/signal.h:46: error: expected `,' or `;' before "typedef" In file included from ../Temp/cuda_memtest-1.2.3/cuda_memtest.h:45, from ../Temp/cuda_memtest-1.2.3/misc.cpp:4: ../Temp/cuda_memtest-1.2.3/pthread.h:30: error: expected constructor, destructor, or type conversion before "typedef" ../Temp/cuda_memtest-1.2.3/pthread.h:30: error: expected `,' or `;' before "typedef" ../Temp/cuda_memtest-1.2.3/pthread.h:49: error: `_pthread_descr' does not name a type ../Temp/cuda_memtest-1.2.3/pthread.h:101: error: `_pthread_descr' does not name a type In file included from ../Temp/cuda_memtest-1.2.3/misc.cpp:4: ../Temp/cuda_memtest-1.2.3/cuda_memtest.h:52: error: expected constructor, destructor, or type conversion before "extern" ../Temp/cuda_memtest-1.2.3/cuda_memtest.h:52: error: expected `,' or `;' before "extern" ../Temp/cuda_memtest-1.2.3/cuda_memtest.h:53: error: declaration of `_iob' as array of references ../Temp/cuda_memtest-1.2.3/cuda_memtest.h:54: error: declaration of `_iob' as array of references ../Temp/cuda_memtest-1.2.3/cuda_memtest.h:58: error: thread-local storage not supported for this target make.exe: *** [../Temp/cuda_memtest-1.2.3/misc.o] Error 1 Ausführung beendet

    Posted 09/05/2012
Read more reviews

Additional Project Details

Intended Audience

Developers, System Administrators

Programming Language

C, C++

Registered

2009-06-01
Screenshots can attract more users to your project.
Features can attract more users to your project.