#110 Build log for CDDB-Py-1.4

open
nobody
None
5
2012-08-25
2010-04-01
Anonymous
No

Build log for CDDB-Py-1.4

Built using 0compile-0.18

Build system: Linux, ubuntu, 2.6.28-18-generic, #60-Ubuntu SMP Fri Mar 12 04:26:47 UTC 2010, x86_64

0compile.properties:

[compile]
interface = http://rox4debian.berlios.de/0install/CDDB-Py.xml
metadir = 0install
download-base-url =
version-modifier =
selections =

Executing: cd "$SRCDIR" && python setup.py build --build-base="$BUILDDIR/build" && cd "$BUILDDIR" && python "$SRCDIR"/setup.py install --home="$DISTDIR" --skip-build
running build
running build_py
creating /home/superbero/Apps/Compile/Library/CDDB-Py/build/build
creating /home/superbero/Apps/Compile/Library/CDDB-Py/build/build/lib.linux-x86_64-2.6
copying CDDB.py -> /home/superbero/Apps/Compile/Library/CDDB-Py/build/build/lib.linux-x86_64-2.6
copying DiscID.py -> /home/superbero/Apps/Compile/Library/CDDB-Py/build/build/lib.linux-x86_64-2.6
running build_ext
building 'cdrom' extension
creating /home/superbero/Apps/Compile/Library/CDDB-Py/build/build/temp.linux-x86_64-2.6
creating /home/superbero/Apps/Compile/Library/CDDB-Py/build/build/temp.linux-x86_64-2.6/unix
gcc -pthread -fno-strict-aliasing -DNDEBUG -g -fwrapv -O2 -Wall -Wstrict-prototypes -fPIC -I/usr/include/python2.6 -c unix/cdrommodule.c -o /home/superbero/Apps/Compile/Library/CDDB-Py/build/build/temp.linux-x86_64-2.6/unix/cdrommodule.o
unix/cdrommodule.c:24:20: error: Python.h: No such file or directory
unix/cdrommodule.c:113: error: expected ‘=’, ‘,’, ‘;’, ‘asm’ or ‘attribute’ before ‘’ token
unix/cdrommodule.c:115: error: expected ‘=’, ‘,’, ‘;’, ‘asm’ or ‘attribute’ before ‘
’ token
unix/cdrommodule.c:147: error: expected ‘=’, ‘,’, ‘;’, ‘asm’ or ‘attribute’ before ‘’ token
unix/cdrommodule.c:203: error: expected ‘=’, ‘,’, ‘;’, ‘asm’ or ‘attribute’ before ‘
’ token
unix/cdrommodule.c:269: error: expected ‘)’ before ‘’ token
unix/cdrommodule.c:274: error: expected ‘=’, ‘,’, ‘;’, ‘asm’ or ‘attribute’ before ‘
’ token
unix/cdrommodule.c:311: error: expected ‘=’, ‘,’, ‘;’, ‘asm’ or ‘attribute’ before ‘cdrom_methods’
unix/cdrommodule.c: In function ‘initcdrom’:
unix/cdrommodule.c:321: error: ‘PyObject’ undeclared (first use in this function)
unix/cdrommodule.c:321: error: (Each undeclared identifier is reported only once
unix/cdrommodule.c:321: error: for each function it appears in.)
unix/cdrommodule.c:321: error: ‘module’ undeclared (first use in this function)
unix/cdrommodule.c:321: error: ‘dict’ undeclared (first use in this function)
unix/cdrommodule.c:321: warning: left-hand operand of comma expression has no effect
unix/cdrommodule.c:323: warning: implicit declaration of function ‘Py_InitModule’
unix/cdrommodule.c:323: error: ‘cdrom_methods’ undeclared (first use in this function)
unix/cdrommodule.c:324: warning: implicit declaration of function ‘PyModule_GetDict’
unix/cdrommodule.c:325: error: ‘cdrom_error’ undeclared (first use in this function)
unix/cdrommodule.c:325: warning: implicit declaration of function ‘PyErr_NewException’
unix/cdrommodule.c:326: warning: implicit declaration of function ‘PyDict_SetItemString’
error: command 'gcc' failed with exit status 1
Build failed with exit code 1

Discussion


Anonymous


Cancel   Add attachments