xclass install problem

Help
DanZ
2007-01-08
2013-03-22
  • DanZ
    DanZ
    2007-01-08

    i am trying to install xclass-0.8.3. My system is Red Hat Fedora Core5.

    when I run MAKE, I get errors as below- can anyone help me?
    Thanks Dan

    ../include/xclass/OXWindow.h:172: error: ‘_id’ was not declared in this scope
    ../include/xclass/OXWindow.h:172: error: ‘XUndefineCursor’ was not declared in this scope
    ../include/xclass/OTimer.h: At global scope:
    ../include/xclass/OTimer.h:61: error: expected `)' before ‘*’ token
    ../include/xclass/OTimer.h:63: error: ‘XPointer’ has not been declared
    ../include/xclass/OXFrame.h:94: error: ‘GC’ does not name a type
    ../include/xclass/OXFrame.h:95: error: ‘GC’ does not name a type
    ../include/xclass/OXFrame.h:96: error: ‘GC’ does not name a type
    ../include/xclass/OXFrame.h:97: error: ‘GC’ does not name a type
    ../include/xclass/OXFrame.h:98: error: ‘Time’ does not name a type
    ../include/xclass/OXFrame.h:106: error: ‘Window’ has not been declared
    ../include/xclass/OXFrame.h:118: error: ‘XEvent’ has not been declared
    ../include/xclass/OXFrame.h:119: error: ‘XConfigureEvent’ has not been declared
    ../include/xclass/OXFrame.h:120: error: ‘XMapEvent’ has not been declared
    ../include/xclass/OXFrame.h:121: error: ‘XUnmapEvent’ has not been declared
    ../include/xclass/OXFrame.h:122: error: ‘XButtonEvent’ has not been declared
    ../include/xclass/OXFrame.h:123: error: ‘XButtonEvent’ has not been declared
    ../include/xclass/OXFrame.h:124: error: ‘XButtonEvent’ has not been declared
    ../include/xclass/OXFrame.h:125: error: ‘XCrossingEvent’ has not been declared
    ../include/xclass/OXFrame.h:126: error: ‘XMotionEvent’ has not been declared
    ../include/xclass/OXFrame.h:127: error: ‘XKeyEvent’ has not been declared
    ../include/xclass/OXFrame.h:128: error: ‘XFocusChangeEvent’ has not been declared
    ../include/xclass/OXFrame.h:129: error: ‘XClientMessageEvent’ has not been declared
    ../include/xclass/OXFrame.h:130: error: ‘XSelectionEvent’ has not been declared
    ../include/xclass/OXFrame.h:131: error: ‘XSelectionRequestEvent’ has not been declared
    ../include/xclass/OXFrame.h:132: error: ‘XSelectionClearEvent’ has not been declared
    ../include/xclass/OXFrame.h:133: error: ‘XPropertyEvent’ has not been declared
    ../include/xclass/OXFrame.h:204: error: ‘GetDNDdata’ declared as a ‘virtual’ field
    ../include/xclass/OXFrame.h:204: error: expected ‘;’ before ‘(’ token
    ../include/xclass/OXFrame.h:205: error: expected `;' before ‘virtual’
    ../include/xclass/OXFrame.h:206: error: ‘Atom’ does not name a type
    ../include/xclass/OXFrame.h:208: error: ‘Atom’ does not name a type
    ../include/xclass/OXFrame.h: In member function ‘virtual int OXFrame::IsComposite() const’:
    ../include/xclass/OXFrame.h:113: error: ‘False’ was not declared in this scope
    ../include/xclass/OXFrame.h: In member function ‘virtual int OXFrame::HandleMapNotify(int*)’:
    ../include/xclass/OXFrame.h:120: error: ‘False’ was not declared in this scope
    ../include/xclass/OXFrame.h: In member function ‘virtual int OXFrame::HandleUnmapNotify(int*)’:
    ../include/xclass/OXFrame.h:121: error: ‘False’ was not declared in this scope
    ../include/xclass/OXFrame.h: In member function ‘virtual int OXFrame::HandleDoubleClick(int*)’:
    ../include/xclass/OXFrame.h:123: error: ‘False’ was not declared in this scope
    ../include/xclass/OXFrame.h: In member function ‘virtual int OXFrame::HandleTripleClick(int*)’:
    ../include/xclass/OXFrame.h:124: error: ‘False’ was not declared in this scope
    ../include/xclass/OXFrame.h: In member function ‘virtual int OXFrame::HandleMotion(int*)’:
    ../include/xclass/OXFrame.h:126: error: ‘False’ was not declared in this scope
    ../include/xclass/OXFrame.h: In member function ‘virtual int OXFrame::HandleKey(int*)’:
    ../include/xclass/OXFrame.h:127: error: ‘False’ was not declared in this scope
    ../include/xclass/OXFrame.h: In member function ‘virtual int OXFrame::HandleSelection(int*)’:
    ../include/xclass/OXFrame.h:130: error: ‘False’ was not declared in this scope
    ../include/xclass/OXFrame.h: In member function ‘virtual int OXFrame::HandleSelectionRequest(int*)’:
    ../include/xclass/OXFrame.h:131: error: ‘False’ was not declared in this scope
    ../include/xclass/OXFrame.h: In member function ‘virtual int OXFrame::HandleSelectionClear(int*)’:
    ../include/xclass/OXFrame.h:132: error: ‘False’ was not declared in this scope
    ../include/xclass/OXFrame.h: In member function ‘virtual int OXFrame::HandlePropertyChange(int*)’:
    ../include/xclass/OXFrame.h:133: error: ‘False’ was not declared in this scope
    ../include/xclass/OXFrame.h: In member function ‘void OXFrame::Enable()’:
    ../include/xclass/OXFrame.h:191: error: ‘True’ was not declared in this scope
    ../include/xclass/OXFrame.h: In member function ‘void OXFrame::Disable()’:
    ../include/xclass/OXFrame.h:192: error: ‘False’ was not declared in this scope
    ../include/xclass/OXFrame.h: In member function ‘virtual int OXFrame::HandleDNDdrop(ODNDdata*)’:
    ../include/xclass/OXFrame.h:205: error: ‘False’ was not declared in this scope
    ../include/xclass/OXFrame.h: In member function ‘virtual int OXFrame::HandleDNDleave()’:
    ../include/xclass/OXFrame.h:209: error: ‘False’ was not declared in this scope
    ../include/xclass/OXFrame.h: In member function ‘virtual int OXFrame::HandleDNDfinished()’:
    ../include/xclass/OXFrame.h:210: error: ‘False’ was not declared in this scope
    ../include/xclass/OXCompositeFrame.h: In member function ‘virtual int OXCompositeFrame::IsComposite() const’:
    ../include/xclass/OXCompositeFrame.h:43: error: ‘True’ was not declared in this scope
    ../include/xclass/OXMainFrame.h: At global scope:
    ../include/xclass/OXMainFrame.h:80: error: ‘XKeyEvent’ has not been declared
    ../include/xclass/OXMainFrame.h:81: error: ‘XConfigureEvent’ has not been declared
    ../include/xclass/OXMainFrame.h:82: error: ‘XClientMessageEvent’ has not been declared
    ../include/xclass/OXMainFrame.h:83: error: ‘XSelectionEvent’ has not been declared
    ../include/xclass/OXMainFrame.h:84: error: ‘XSelectionRequestEvent’ has not been declared
    ../include/xclass/OXMainFrame.h:85: error: ‘XSelectionClearEvent’ has not been declared
    ../include/xclass/OXMainFrame.h:124: error: ‘CARD32’ does not name a type
    ../include/xclass/OXMainFrame.h:125: error: ‘CARD32’ does not name a type
    ../include/xclass/OXMainFrame.h:126: error: ‘CARD32’ does not name a type
    ../include/xclass/OXMainFrame.h:127: error: ‘INT32’ does not name a type
    ../include/xclass/OXMainFrame.h:129: error: ‘XSizeHints’ does not name a type
    ../include/xclass/OXTransientFrame.h:37: error: ‘True’ was not declared in this scope
    ../include/xclass/OXButton.h:64: error: ‘XButtonEvent’ has not been declared
    ../include/xclass/OXButton.h:65: error: ‘XCrossingEvent’ has not been declared
    ../include/xclass/OXButton.h:69: error: ‘True’ was not declared in this scope
    ../include/xclass/OPicture.h:42: error: ‘Pixmap’ does not name a type
    ../include/xclass/OPicture.h:43: error: ‘Pixmap’ does not name a type
    ../include/xclass/OPicture.h:46: error: ‘Display’ has not been declared
    ../include/xclass/OPicture.h:46: error: ‘XID’ has not been declared
    ../include/xclass/OPicture.h:46: error: ‘GC’ has not been declared
    ../include/xclass/OPicture.h:47: error: ‘Display’ has not been declared
    ../include/xclass/OPicture.h:47: error: ‘XID’ has not been declared
    ../include/xclass/OPicture.h:47: error: ‘GC’ has not been declared
    ../include/xclass/OPicture.h:60: error: ‘XpmAttributes’ does not name a type
    ../include/xclass/OPicture.h:61: error: ‘Pixmap’ does not name a type
    ../include/xclass/OPicture.h:62: error: ‘Pixmap’ does not name a type
    ../include/xclass/OPicture.h:52: error: ‘False’ was not declared in this scope
    ../include/xclass/OPicture.h: In member function ‘int OPicture::GetWidth() const’:
    ../include/xclass/OPicture.h:40: error: ‘_attributes’ was not declared in this scope
    ../include/xclass/OPicture.h: In member function ‘int OPicture::GetHeight() const’:
    ../include/xclass/OPicture.h:41: error: ‘_attributes’ was not declared in this scope
    ../include/xclass/OPicture.h: At global scope:
    ../include/xclass/OPicture.h:93: error: ‘XpmColorSymbol’ does not name a type
    ../include/xclass/OPicture.h:98: error: ‘Colormap’ does not name a type
    ../include/xclass/OResourcePool.h:133: error: ‘Pixel’ does not name a type
    ../include/xclass/OResourcePool.h:134: error: ‘Pixel’ does not name a type
    ../include/xclass/OResourcePool.h:136: error: ‘Pixel’ does not name a type
    ../include/xclass/OResourcePool.h:137: error: ‘Pixel’ does not name a type
    ../include/xclass/OResourcePool.h:138: error: ‘Pixel’ does not name a type
    ../include/xclass/OResourcePool.h:139: error: ‘Pixel’ does not name a type
    ../include/xclass/OResourcePool.h:141: error: ‘Pixel’ does not name a type
    ../include/xclass/OResourcePool.h:142: error: ‘Pixel’ does not name a type
    ../include/xclass/OResourcePool.h:144: error: ‘Pixel’ does not name a type
    ../include/xclass/OResourcePool.h:145: error: ‘Pixel’ does not name a type
    ../include/xclass/OResourcePool.h:147: error: ‘Pixel’ does not name a type
    ../include/xclass/OResourcePool.h:148: error: ‘Pixel’ does not name a type
    ../include/xclass/OResourcePool.h:181: error: ‘Pixmap’ does not name a type
    ../include/xclass/OResourcePool.h:182: error: ‘Pixmap’ does not name a type
    ../include/xclass/OResourcePool.h:192: error: ‘Cursor’ does not name a type
    ../include/xclass/OResourcePool.h:193: error: ‘Cursor’ does not name a type
    ../include/xclass/OResourcePool.h:194: error: ‘Cursor’ does not name a type
    ../include/xclass/OResourcePool.h:195: error: ‘Cursor’ does not name a type
    ../include/xclass/OResourcePool.h:199: error: ‘Colormap’ does not name a type
    ../include/xclass/OResourcePool.h:211: error: ISO C++ forbids declaration of ‘Display’ with no type
    ../include/xclass/OResourcePool.h:211: error: expected ‘;’ before ‘*’ token
    ../include/xclass/OResourcePool.h:213: error: ‘Colormap’ does not name a type
    ../include/xclass/OResourcePool.h:215: error: ‘Pixel’ does not name a type
    ../include/xclass/OResourcePool.h:216: error: ‘Pixel’ does not name a type
    ../include/xclass/OResourcePool.h:217: error: ‘Pixel’ does not name a type
    ../include/xclass/OResourcePool.h:218: error: ‘Pixel’ does not name a type
    ../include/xclass/OResourcePool.h:219: error: ‘Pixel’ does not name a type
    ../include/xclass/OResourcePool.h:242: error: ‘Cursor’ does not name a type
    ../include/xclass/OResourcePool.h:244: error: ‘Pixmap’ does not name a type
    ../include/xclass/OResourcePool.h:126: error: ‘False’ was not declared in this scope
    ../include/xclass/OXFont.h:155: error: ‘Display’ has not been declared
    ../include/xclass/OXFont.h:155: error: ‘Drawable’ has not been declared
    ../include/xclass/OXFont.h:155: error: ‘GC’ has not been declared
    ../include/xclass/OXFont.h:157: error: ‘Display’ has not been declared
    ../include/xclass/OXFont.h:157: error: ‘Drawable’ has not been declared
    ../include/xclass/OXFont.h:157: error: ‘GC’ has not been declared
    ../include/xclass/OXFont.h:195: error: ‘Display’ has not been declared
    ../include/xclass/OXFont.h:195: error: ‘Drawable’ has not been declared
    ../include/xclass/OXFont.h:195: error: ‘GC’ has not been declared
    ../include/xclass/OXFont.h:203: error: ‘Display’ has not been declared
    ../include/xclass/OXFont.h:203: error: ‘Drawable’ has not been declared
    ../include/xclass/OXFont.h:203: error: ‘GC’ has not been declared
    ../include/xclass/OXFont.h:205: error: ‘Display’ has not been declared
    ../include/xclass/OXFont.h:205: error: ‘Drawable’ has not been declared
    ../include/xclass/OXFont.h:205: error: ‘GC’ has not been declared
    ../include/xclass/OXFont.h:212: error: ‘XID’ has not been declared
    ../include/xclass/OXFont.h:242: error: ISO C++ forbids declaration of ‘Display’ with no type
    ../include/xclass/OXFont.h:242: error: expected ‘;’ before ‘*’ token
    ../include/xclass/OXFont.h:243: error: ISO C++ forbids declaration of ‘XFontStruct’ with no type
    ../include/xclass/OXFont.h:243: error: expected ‘;’ before ‘*’ token
    ../include/xclass/OXFont.h: In member function ‘void OXFont::SetId(int)’:
    ../include/xclass/OXFont.h:212: error: ‘_id’ was not declared in this scope
    ../include/xclass/OXFont.h: At global scope:
    ../include/xclass/OXFont.h:348: error: ‘XFontStruct’ has not been declared
    ../include/xclass/OXTextButton.h:51: error: ‘XKeyEvent’ has not been declared
    ../include/xclass/OXResizer.h:158: error: ‘XButtonEvent’ has not been declared
    ../include/xclass/OXResizer.h:159: error: ‘XMotionEvent’ has not been declared
    ../include/xclass/OXResizer.h:199: error: ‘XButtonEvent’ has not been declared
    ../include/xclass/OXResizer.h:200: error: ‘XMotionEvent’ has not been declared
    ../include/xclass/OXResizer.h:240: error: ‘XButtonEvent’ has not been declared
    ../include/xclass/OXResizer.h:242: error: ‘XMotionEvent’ has not been declared
    ../include/xclass/OGC.h:34: error: expected `)' before ‘*’ token
    ../include/xclass/OGC.h:48: error: ‘GC’ does not name a type
    ../include/xclass/OGC.h:50: error: ‘XGCValues’ has not been declared
    ../include/xclass/OGC.h:62: error: ‘Pixmap’ has not been declared
    ../include/xclass/OGC.h:63: error: ‘Pixmap’ has not been declared
    ../include/xclass/OGC.h:66: error: ‘Font’ has not been declared
    ../include/xclass/OGC.h:68: error: ‘Bool’ has not been declared
    ../include/xclass/OGC.h:71: error: ‘Pixmap’ has not been declared
    ../include/xclass/OGC.h:76: error: ISO C++ forbids declaration of ‘XGCValues’ with no type
    ../include/xclass/OGC.h:76: error: expected ‘;’ before ‘*’ token
    ../include/xclass/OGC.h:77: error: expected `;' before ‘unsigned’
    ../include/xclass/OGC.h:84: error: ‘Font’ does not name a type
    ../include/xclass/OGC.h:94: error: ‘XGCValues’ does not name a type
    ../include/xclass/OGC.h:96: error: ‘GC’ does not name a type
    ../include/xclass/OGC.h:97: error: ISO C++ forbids declaration of ‘Display’ with no type
    ../include/xclass/OGC.h:97: error: expected ‘;’ before ‘*’ token
    ../include/xclass/OGC.h:98: error: ‘Drawable’ does not name a type
    ../include/xclass/OGC.h: In constructor ‘OXGC::OXGC(const OXGC*)’:
    ../include/xclass/OGC.h:43: error: ‘_values’ was not declared in this scope
    ../include/xclass/OGC.h:43: error: ‘const class OXGC’ has no member named ‘_values’
    ../include/xclass/OGC.h:43: error: ‘XGCValues’ was not declared in this scope
    ../include/xclass/OGC.h:44: error: ‘_gc’ was not declared in this scope
    ../include/xclass/OGC.h:44: error: ‘_dpy’ was not declared in this scope
    ../include/xclass/OGC.h:44: error: ‘const class OXGC’ has no member named ‘_dpy’
    ../include/xclass/OGC.h:44: error: ‘_d’ was not declared in this scope
    ../include/xclass/OGC.h:44: error: ‘const class OXGC’ has no member named ‘_d’
    ../include/xclass/OGC.h:44: error: ‘XCreateGC’ was not declared in this scope
    ../include/xclass/OGC.h: In destructor ‘virtual OXGC::~OXGC()’:
    ../include/xclass/OGC.h:46: error: ‘_dpy’ was not declared in this scope
    ../include/xclass/OGC.h:46: error: ‘_gc’ was not declared in this scope
    ../include/xclass/OGC.h:46: error: ‘XFreeGC’ was not declared in this scope
    ../include/xclass/OGC.h: In member function ‘void OXGC::SetAttributes(long unsigned int, int*)’:
    ../include/xclass/OGC.h:51: error: ‘_dpy’ was not declared in this scope
    ../include/xclass/OGC.h:51: error: ‘_gc’ was not declared in this scope
    ../include/xclass/OGC.h:51: error: ‘XChangeGC’ was not declared in this scope
    ../include/xclass/OGC.h: In member function ‘void OXGC::SetFunction(int)’:
    ../include/xclass/OGC.h:52: error: ‘_values’ was not declared in this scope
    ../include/xclass/OGC.h:52: error: ‘_dpy’ was not declared in this scope
    ../include/xclass/OGC.h:52: error: ‘_gc’ was not declared in this scope
    ../include/xclass/OGC.h:52: error: ‘GCFunction’ was not declared in this scope
    ../include/xclass/OGC.h:52: error: ‘XChangeGC’ was not declared in this scope
    ../include/xclass/OGC.h: In member function ‘void OXGC::SetPlaneMask(long unsigned int)’:
    ../include/xclass/OGC.h:53: error: ‘_values’ was not declared in this scope
    ../include/xclass/OGC.h:53: error: ‘_dpy’ was not declared in this scope
    ../include/xclass/OGC.h:53: error: ‘_gc’ was not declared in this scope
    ../include/xclass/OGC.h:53: error: ‘GCPlaneMask’ was not declared in this scope
    ../include/xclass/OGC.h:53: error: ‘XChangeGC’ was not declared in this scope
    ../include/xclass/OGC.h: In member function ‘void OXGC::SetBackground(long unsigned int)’:
    ../include/xclass/OGC.h:54: error: ‘_values’ was not declared in this scope
    ../include/xclass/OGC.h:54: error: ‘_dpy’ was not declared in this scope
    ../include/xclass/OGC.h:54: error: ‘_gc’ was not declared in this scope
    ../include/xclass/OGC.h:54: error: ‘GCBackground’ was not declared in this scope
    ../include/xclass/OGC.h:54: error: ‘XChangeGC’ was not declared in this scope
    ../include/xclass/OGC.h: In member function ‘void OXGC::SetForeground(long unsigned int)’:
    ../include/xclass/OGC.h:55: error: ‘_values’ was not declared in this scope
    ../include/xclass/OGC.h:55: error: ‘_dpy’ was not declared in this scope
    ../include/xclass/OGC.h:55: error: ‘_gc’ was not declared in this scope
    ../include/xclass/OGC.h:55: error: ‘GCForeground’ was not declared in this scope
    ../include/xclass/OGC.h:55: error: ‘XChangeGC’ was not declared in this scope
    ../include/xclass/OGC.h: In member function ‘void OXGC::SetLineWidth(int)’:
    ../include/xclass/OGC.h:56: error: ‘_values’ was not declared in this scope
    ../include/xclass/OGC.h:56: error: ‘_dpy’ was not declared in this scope
    ../include/xclass/OGC.h:56: error: ‘_gc’ was not declared in this scope
    ../include/xclass/OGC.h:56: error: ‘GCLineWidth’ was not declared in this scope
    ../include/xclass/OGC.h:56: error: ‘XChangeGC’ was not declared in this scope
    ../include/xclass/OGC.h: In member function ‘void OXGC::SetLineStyle(int)’:
    ../include/xclass/OGC.h:57: error: ‘_values’ was not declared in this scope
    ../include/xclass/OGC.h:57: error: ‘_dpy’ was not declared in this scope
    ../include/xclass/OGC.h:57: error: ‘_gc’ was not declared in this scope
    ../include/xclass/OGC.h:57: error: ‘GCLineStyle’ was not declared in this scope
    ../include/xclass/OGC.h:57: error: ‘XChangeGC’ was not declared in this scope
    ../include/xclass/OGC.h: In member function ‘void OXGC::SetCapStyle(int)’:
    ../include/xclass/OGC.h:58: error: ‘_values’ was not declared in this scope
    ../include/xclass/OGC.h:58: error: ‘_dpy’ was not declared in this scope
    ../include/xclass/OGC.h:58: error: ‘_gc’ was not declared in this scope
    ../include/xclass/OGC.h:58: error: ‘GCCapStyle’ was not declared in this scope
    ../include/xclass/OGC.h:58: error: ‘XChangeGC’ was not declared in this scope
    ../include/xclass/OGC.h: In member function ‘void OXGC::SetJoinStyle(int)’:
    ../include/xclass/OGC.h:59: error: ‘_values’ was not declared in this scope
    ../include/xclass/OGC.h:59: error: ‘_dpy’ was not declared in this scope
    ../include/xclass/OGC.h:59: error: ‘_gc’ was not declared in this scope
    ../include/xclass/OGC.h:59: error: ‘GCJoinStyle’ was not declared in this scope
    ../include/xclass/OGC.h:59: error: ‘XChangeGC’ was not declared in this scope
    ../include/xclass/OGC.h: In member function ‘void OXGC::SetFillStyle(int)’:
    ../include/xclass/OGC.h:60: error: ‘_values’ was not declared in this scope
    ../include/xclass/OGC.h:60: error: ‘_dpy’ was not declared in this scope
    ../include/xclass/OGC.h:60: error: ‘_gc’ was not declared in this scope
    ../include/xclass/OGC.h:60: error: ‘GCFillStyle’ was not declared in this scope
    ../include/xclass/OGC.h:60: error: ‘XChangeGC’ was not declared in this scope
    ../include/xclass/OGC.h: In member function ‘void OXGC::SetFillRule(int)’:
    ../include/xclass/OGC.h:61: error: ‘_values’ was not declared in this scope
    ../include/xclass/OGC.h:61: error: ‘_dpy’ was not declared in this scope
    ../include/xclass/OGC.h:61: error: ‘_gc’ was not declared in this scope
    ../include/xclass/OGC.h:61: error: ‘GCFillRule’ was not declared in this scope
    ../include/xclass/OGC.h:61: error: ‘XChangeGC’ was not declared in this scope
    ../include/xclass/OGC.h: In member function ‘void OXGC::SetTile(int)’:
    ../include/xclass/OGC.h:62: error: ‘_values’ was not declared in this scope
    ../include/xclass/OGC.h:62: error: ‘_dpy’ was not declared in this scope
    ../include/xclass/OGC.h:62: error: ‘_gc’ was not declared in this scope
    ../include/xclass/OGC.h:62: error: ‘GCTile’ was not declared in this scope
    ../include/xclass/OGC.h:62: error: ‘XChangeGC’ was not declared in this scope
    ../include/xclass/OGC.h: In member function ‘void OXGC::SetStipple(int)’:
    ../include/xclass/OGC.h:63: error: ‘_values’ was not declared in this scope
    ../include/xclass/OGC.h:63: error: ‘_dpy’ was not declared in this scope
    ../include/xclass/OGC.h:63: error: ‘_gc’ was not declared in this scope
    ../include/xclass/OGC.h:63: error: ‘GCStipple’ was not declared in this scope
    ../include/xclass/OGC.h:63: error: ‘XChangeGC’ was not declared in this scope
    ../include/xclass/OGC.h: In member function ‘void OXGC::SetTileStipXOrigin(int)’:
    ../include/xclass/OGC.h:64: error: ‘_values’ was not declared in this scope
    ../include/xclass/OGC.h:64: error: ‘_dpy’ was not declared in this scope
    ../include/xclass/OGC.h:64: error: ‘_gc’ was not declared in this scope
    ../include/xclass/OGC.h:64: error: ‘GCTileStipXOrigin’ was not declared in this scope
    ../include/xclass/OGC.h:64: error: ‘XChangeGC’ was not declared in this scope
    ../include/xclass/OGC.h: In member function ‘void OXGC::SetTileStipYOrigin(int)’:
    ../include/xclass/OGC.h:65: error: ‘_values’ was not declared in this scope
    ../include/xclass/OGC.h:65: error: ‘_dpy’ was not declared in this scope
    ../include/xclass/OGC.h:65: error: ‘_gc’ was not declared in this scope
    ../include/xclass/OGC.h:65: error: ‘GCTileStipYOrigin’ was not declared in this scope
    ../include/xclass/OGC.h:65: error: ‘XChangeGC’ was not declared in this scope
    ../include/xclass/OGC.h: In member function ‘void OXGC::SetFont(int)’:
    ../include/xclass/OGC.h:66: error: ‘_values’ was not declared in this scope
    ../include/xclass/OGC.h:66: error: ‘_dpy’ was not declared in this scope
    ../include/xclass/OGC.h:66: error: ‘_gc’ was not declared in this scope
    ../include/xclass/OGC.h:66: error: ‘GCFont’ was not declared in this scope
    ../include/xclass/OGC.h:66: error: ‘XChangeGC’ was not declared in this scope
    ../include/xclass/OGC.h: In member function ‘void OXGC::SetSubwindowMode(int)’:
    ../include/xclass/OGC.h:67: error: ‘_values’ was not declared in this scope
    ../include/xclass/OGC.h:67: error: ‘_dpy’ was not declared in this scope
    ../include/xclass/OGC.h:67: error: ‘_gc’ was not declared in this scope
    ../include/xclass/OGC.h:67: error: ‘GCSubwindowMode’ was not declared in this scope
    ../include/xclass/OGC.h:67: error: ‘XChangeGC’ was not declared in this scope
    ../include/xclass/OGC.h: In member function ‘void OXGC::SetGraphicsExposures(int)’:
    ../include/xclass/OGC.h:68: error: ‘_values’ was not declared in this scope
    ../include/xclass/OGC.h:68: error: ‘_dpy’ was not declared in this scope
    ../include/xclass/OGC.h:68: error: ‘_gc’ was not declared in this scope
    ../include/xclass/OGC.h:68: error: ‘GCGraphicsExposures’ was not declared in this scope
    ../include/xclass/OGC.h:68: error: ‘XChangeGC’ was not declared in this scope
    ../include/xclass/OGC.h: In member function ‘void OXGC::SetClipXOrigin(int)’:
    ../include/xclass/OGC.h:69: error: ‘_values’ was not declared in this scope
    ../include/xclass/OGC.h:69: error: ‘_dpy’ was not declared in this scope
    ../include/xclass/OGC.h:69: error: ‘_gc’ was not declared in this scope
    ../include/xclass/OGC.h:69: error: ‘GCClipXOrigin’ was not declared in this scope
    ../include/xclass/OGC.h:69: error: ‘XChangeGC’ was not declared in this scope
    ../include/xclass/OGC.h: In member function ‘void OXGC::SetClipYOrigin(int)’:
    ../include/xclass/OGC.h:70: error: ‘_values’ was not declared in this scope
    ../include/xclass/OGC.h:70: error: ‘_dpy’ was not declared in this scope
    ../include/xclass/OGC.h:70: error: ‘_gc’ was not declared in this scope
    ../include/xclass/OGC.h:70: error: ‘GCClipYOrigin’ was not declared in this scope
    ../include/xclass/OGC.h:70: error: ‘XChangeGC’ was not declared in this scope
    ../include/xclass/OGC.h: In member function ‘void OXGC::SetClipMask(int)’:
    ../include/xclass/OGC.h:71: error: ‘_values’ was not declared in this scope
    ../include/xclass/OGC.h:71: error: ‘_dpy’ was not declared in this scope
    ../include/xclass/OGC.h:71: error: ‘_gc’ was not declared in this scope
    ../include/xclass/OGC.h:71: error: ‘GCClipMask’ was not declared in this scope
    ../include/xclass/OGC.h:71: error: ‘XChangeGC’ was not declared in this scope
    ../include/xclass/OGC.h: In member function ‘void OXGC::SetDashOffset(int)’:
    ../include/xclass/OGC.h:72: error: ‘_values’ was not declared in this scope
    ../include/xclass/OGC.h:72: error: ‘_dpy’ was not declared in this scope
    ../include/xclass/OGC.h:72: error: ‘_gc’ was not declared in this scope
    ../include/xclass/OGC.h:72: error: ‘GCDashOffset’ was not declared in this scope
    ../include/xclass/OGC.h:72: error: ‘XChangeGC’ was not declared in this scope
    ../include/xclass/OGC.h: In member function ‘void OXGC::SetDashList(char)’:
    ../include/xclass/OGC.h:73: error: ‘_values’ was not declared in this scope
    ../include/xclass/OGC.h:73: error: ‘_dpy’ was not declared in this scope
    ../include/xclass/OGC.h:73: error: ‘_gc’ was not declared in this scope
    ../include/xclass/OGC.h:73: error: ‘GCDashList’ was not declared in this scope
    ../include/xclass/OGC.h:73: error: ‘XChangeGC’ was not declared in this scope
    ../include/xclass/OGC.h: In member function ‘void OXGC::SetArcMode(int)’:
    ../include/xclass/OGC.h:74: error: ‘_values’ was not declared in this scope
    ../include/xclass/OGC.h:74: error: ‘_dpy’ was not declared in this scope
    ../include/xclass/OGC.h:74: error: ‘_gc’ was not declared in this scope
    ../include/xclass/OGC.h:74: error: ‘GCArcMode’ was not declared in this scope
    ../include/xclass/OGC.h:74: error: ‘XChangeGC’ was not declared in this scope
    ../include/xclass/OGC.h: In member function ‘int OXGC::GetFunction() const’:
    ../include/xclass/OGC.h:79: error: ‘_values’ was not declared in this scope
    ../include/xclass/OGC.h: In member function ‘long unsigned int OXGC::GetForeground() const’:
    ../include/xclass/OGC.h:80: error: ‘_values’ was not declared in this scope
    ../include/xclass/OGC.h: In member function ‘long unsigned int OXGC::GetBackground() const’:
    ../include/xclass/OGC.h:81: error: ‘_values’ was not declared in this scope
    ../include/xclass/OGC.h: In member function ‘int OXGC::GetLineWidth() const’:
    ../include/xclass/OGC.h:82: error: ‘_values’ was not declared in this scope
    ../include/xclass/OGC.h: In member function ‘int OXGC::GetLineStyle() const’:
    ../include/xclass/OGC.h:83: error: ‘_values’ was not declared in this scope
    ../include/xclass/OGC.h: In member function ‘int OXGC::GetCapStyle() const’:
    ../include/xclass/OGC.h:85: error: ‘_values’ was not declared in this scope
    ../include/xclass/OGC.h: In member function ‘int OXGC::GetJoinStyle() const’:
    ../include/xclass/OGC.h:86: error: ‘_values’ was not declared in this scope
    ../include/xclass/OGC.h: In member function ‘int OXGC::GetFillStyle() const’:
    ../include/xclass/OGC.h:87: error: ‘_values’ was not declared in this scope
    ../include/xclass/OGC.h: In member function ‘int OXGC::GetFillRule() const’:
    ../include/xclass/OGC.h:88: error: ‘_values’ was not declared in this scope
    ../include/xclass/OGC.h: At global scope:
    ../include/xclass/OGC.h:106: error: expected ‘;’ before ‘(’ token
    ../include/xclass/OGC.h:109: error: expected ‘,’ or ‘...’ before ‘gc’
    ../include/xclass/OGC.h:109: error: ISO C++ forbids declaration of ‘GC’ with no type
    ../include/xclass/OGC.h:114: error: ‘XGCValues’ has not been declared
    ../include/xclass/OGC.h:115: error: ‘XGCValues’ has not been declared
    ../include/xclass/OXScrollBar.h: In constructor ‘OXScrollBarElt::OXScrollBarElt(const OXWindow*, const OPicture*, int, int, unsigned int, long unsigned int)’:
    ../include/xclass/OXScrollBar.h:66: error: ‘False’ was not declared in this scope
    ../include/xclass/OXScrollBar.h: At global scope:
    ../include/xclass/OXScrollBar.h:83: error: ‘Pixmap’ does not name a type
    ../include/xclass/OXScrollBar.h:94: error: ‘XButtonEvent’ has not been declared
    ../include/xclass/OXScrollBar.h:95: error: ‘XMotionEvent’ has not been declared
    ../include/xclass/OXScrollBar.h:115: error: ‘Window’ does not name a type
    ../include/xclass/OXScrollBar.h:100: error: ‘True’ was not declared in this scope
    ../include/xclass/OXScrollBar.h:103: error: ‘True’ was not declared in this scope
    ../include/xclass/OXScrollBar.h:125: error: ‘XButtonEvent’ has not been declared
    ../include/xclass/OXScrollBar.h:126: error: ‘XMotionEvent’ has not been declared
    ../include/xclass/OXScrollBar.h:132: error: ‘True’ was not declared in this scope
    ../include/xclass/OXScrollBar.h:133: error: ‘True’ was not declared in this scope
    ../include/xclass/OXScrollBar.h:143: error: ‘XButtonEvent’ has not been declared
    ../include/xclass/OXScrollBar.h:144: error: ‘XMotionEvent’ has not been declared
    ../include/xclass/OXScrollBar.h:150: error: ‘True’ was not declared in this scope
    ../include/xclass/OXScrollBar.h:151: error: ‘True’ was not declared in this scope
    ../include/xclass/OXView.h:81: error: ‘XButtonEvent’ has not been declared
    ../include/xclass/OXView.h:82: error: ‘XExposeEvent’ has not been declared
    ../include/xclass/OXView.h:83: error: ‘XGraphicsExposeEvent’ has not been declared
    ../include/xclass/OXView.h:154: error: ‘GC’ does not name a type
    ../include/xclass/OXView.h:88: error: ‘True’ was not declared in this scope
    ../include/xclass/OXView.h: In member function ‘virtual bool OXView::ItemLayout()’:
    ../include/xclass/OXView.h:128: error: ‘False’ was not declared in this scope
    ../include/xclass/OXView.h: At global scope:
    ../include/xclass/OXView.h:164: error: ‘XSelectionRequestEvent’ has not been declared
    ../include/xclass/OXView.h:166: error: ‘XSelectionClearEvent’ has not been declared
    ../include/xclass/OXView.h:168: error: ‘XSelectionEvent’ has not been declared
    ../include/xclass/OXView.h:170: error: ‘XButtonEvent’ has not been declared
    ../include/xclass/OXView.h:172: error: ‘XButtonEvent’ has not been declared
    ../include/xclass/OXView.h:174: error: ‘XButtonEvent’ has not been declared
    ../include/xclass/OXView.h:176: error: ‘XExposeEvent’ has not been declared
    ../include/xclass/OXView.h:178: error: ‘XGraphicsExposeEvent’ has not been declared
    ../include/xclass/OXView.h:180: error: ‘XCrossingEvent’ has not been declared
    ../include/xclass/OXView.h:182: error: ‘XMotionEvent’ has not been declared
    ../include/xclass/OXView.h:184: error: ‘XKeyEvent’ has not been declared
    ../include/xclass/OXView.h:189: error: ‘Atom’ does not name a type
    ../include/xclass/OXView.h:193: error: ‘Atom’ does not name a type
    ../include/xclass/OXView.h:199: error: ‘GetDNDdata’ declared as a ‘virtual’ field
    ../include/xclass/OXView.h:199: error: expected ‘;’ before ‘(’ token
    ../include/xclass/OXView.h:202: error: expected `;' before ‘}’ token
    ../include/xclass/OXView.h: In member function ‘virtual int OXViewCanvas::HandleExpose(int*)’:
    ../include/xclass/OXView.h:177: error: ‘True’ was not declared in this scope
    ../include/xclass/OXView.h: In member function ‘virtual int OXViewCanvas::HandleGraphicsExpose(int*)’:
    ../include/xclass/OXView.h:179: error: ‘True’ was not declared in this scope
    ../include/xclass/OXItemView.h: At global scope:
    ../include/xclass/OXItemView.h:87: error: ‘GC’ does not name a type
    ../include/xclass/OXItemView.h:110: error: ‘XButtonEvent’ has not been declared
    ../include/xclass/OXItemView.h:111: error: ‘XButtonEvent’ has not been declared
    ../include/xclass/OXItemView.h:112: error: ‘XMotionEvent’ has not been declared
    ../include/xclass/OXItemView.h:115: error: ‘XMotionEvent’ has not been declared
    ../include/xclass/OXItemView.h:105: error: ‘True’ was not declared in this scope
    ../include/xclass/OXItemView.h: In member function ‘virtual bool OXItemView::ItemLayout()’:
    ../include/xclass/OXItemView.h:145: error: ‘False’ was not declared in this scope
    ../include/xclass/OXListView.h: At global scope:
    ../include/xclass/OXListView.h:81: error: ‘GC’ has not been declared
    ../include/xclass/OXListView.h:114: error: ‘XKeyEvent’ has not been declared
    ../include/xclass/OXListView.h:115: error: ‘XButtonEvent’ has not been declared
    ../include/xclass/OXListView.h:132: error: ‘True’ was not declared in this scope
    ../include/xclass/OXListView.h:142: error: ‘True’ was not declared in this scope
    ../include/xclass/OXFileList.h:55: error: ‘Atom’ has not been declared
    ../include/xclass/OXFileList.h:63: error: ‘Atom’ does not name a type
    ../include/xclass/OXFileList.h: In constructor ‘ODNDmessage::ODNDmessage(int, int, int, ODNDdata*, int, OPosition, OFileItem*)’:
    ../include/xclass/OXFileList.h:58: error: ‘dndAction’ was not declared in this scope
    ../include/xclass/OXFileList.h: At global scope:
    ../include/xclass/OXFileList.h:109: error: ‘Atom’ does not name a type
    ../include/xclass/OXFileList.h:117: error: ‘XButtonEvent’ has not been declared
    ../include/xclass/OXFileList.h:118: error: ‘XMotionEvent’ has not been declared
    ../include/xclass/OXFileList.h:133: error: ‘Atom’ does not name a type
    ../include/xclass/OXFileList.h:135: error: ‘Atom’ does not name a type
    ../include/xclass/OXFileList.h:138: error: ‘GetDNDdata’ declared as a ‘virtual’ field
    ../include/xclass/OXFileList.h:138: error: expected ‘;’ before ‘(’ token
    ../include/xclass/OXFileList.h:123: error: ‘True’ was not declared in this scope
    ../include/xclass/OXFileList.h:126: error: ‘False’ was not declared in this scope
    ../include/xclass/OXFileList.h:127: error: ‘True’ was not declared in this scope
    ../include/xclass/OXFileList.h:128: error: ‘True’ was not declared in this scope
    ../include/xclass/OXCanvas.h:100: error: ‘XButtonEvent’ has not been declared
    ../include/xclass/OXListBox.h: In constructor ‘OXLBEntry::OXLBEntry(const OXWindow*, int, unsigned int, long unsigned int)’:
    ../include/xclass/OXListBox.h:68: error: ‘False’ was not declared in this scope
    ../include/xclass/OXListBox.h: At global scope:
    ../include/xclass/OXListBox.h:126: error: ‘XKeyEvent’ has not been declared
    ../include/xclass/OXListBox.h:127: error: ‘XButtonEvent’ has not been declared
    ../include/xclass/OXListBox.h:128: error: ‘XMotionEvent’ has not been declared
    ../include/xclass/OXListBox.h:177: error: ‘XKeyEvent’ has not been declared
    ../include/xclass/OXDDListBox.h:43: error: ‘XButtonEvent’ has not been declared
    ../include/xclass/OXDDListBox.h:44: error: ‘XKeyEvent’ has not been declared
    ../include/xclass/OXDDListBox.h:70: error: ‘XButtonEvent’ has not been declared
    ../include/xclass/OXDDListBox.h:71: error: ‘XKeyEvent’ has not been declared
    ../include/xclass/OXTextEntry.h:61: error: ‘XButtonEvent’ has not been declared
    ../include/xclass/OXTextEntry.h:62: error: ‘XButtonEvent’ has not been declared
    ../include/xclass/OXTextEntry.h:63: error: ‘XMotionEvent’ has not been declared
    ../include/xclass/OXTextEntry.h:64: error: ‘XKeyEvent’ has not been declared
    ../include/xclass/OXTextEntry.h:65: error: ‘XCrossingEvent’ has not been declared
    ../include/xclass/OXTextEntry.h:66: error: ‘XSelectionEvent’ has not been declared
    ../include/xclass/OXTextEntry.h:92: error: ‘GC’ has not been declared
    ../include/xclass/OXTextEntry.h:93: error: ‘GC’ has not been declared
    ../include/xclass/OXTextEntry.h:99: error: ‘Window’ has not been declared
    ../include/xclass/OXTextEntry.h:99: error: ‘Atom’ has not been declared
    ../include/xclass/OXTextEntry.h:75: error: ‘False’ was not declared in this scope
    ../include/xclass/OXTextEntry.h:76: error: ‘False’ was not declared in this scope
    ../include/xclass/OXTextEntry.h:77: error: ‘False’ was not declared in this scope
    ../include/xclass/OXTextEntry.h:78: error: ‘False’ was not declared in this scope
    ../include/xclass/OXFileDialog.h:61: error: ‘XMapEvent’ has not been declared
    ../include/xclass/OXFileDialog.h:62: error: ‘XKeyEvent’ has not been declared
    ../include/xclass/OXToolBar.h:76: error: ‘False’ was not declared in this scope
    ../include/xclass/OXToolBar.h:76: error: ‘False’ was not declared in this scope
    ../include/xclass/OXMenu.h:90: error: ‘XButtonEvent’ has not been declared
    ../include/xclass/OXMenu.h:91: error: ‘XMotionEvent’ has not been declared
    ../include/xclass/OXMenu.h:92: error: ‘XKeyEvent’ has not been declared
    ../include/xclass/OXMenu.h:128: error: ‘GC’ has not been declared
    ../include/xclass/OXMenu.h:129: error: ‘GC’ has not been declared
    ../include/xclass/OXMenu.h:130: error: ‘GC’ has not been declared
    ../include/xclass/OXMenu.h:118: error: ‘True’ was not declared in this scope
    ../include/xclass/OXMenu.h:162: error: ‘XButtonEvent’ has not been declared
    ../include/xclass/OXMenu.h:163: error: ‘XMotionEvent’ has not been declared
    ../include/xclass/OXMenu.h:164: error: ‘XKeyEvent’ has not been declared
    ../include/xclass/OXMenu.h:186: error: ‘XButtonEvent’ has not been declared
    ../include/xclass/OXMenu.h:187: error: ‘XMotionEvent’ has not been declared
    ../include/xclass/OXMenu.h:188: error: ‘XKeyEvent’ has not been declared
    ../include/xclass/OX3dLines.h: In member function ‘virtual void OXHorizontal3dLine::DrawBorder()’:
    ../include/xclass/OX3dLines.h:42: error: ‘_shadowGC’ was not declared in this scope
    ../include/xclass/OX3dLines.h:43: error: ‘_hilightGC’ was not declared in this scope
    ../include/xclass/OX3dLines.h: In member function ‘virtual void OXVertical3dLine::DrawBorder()’:
    ../include/xclass/OX3dLines.h:57: error: ‘_shadowGC’ was not declared in this scope
    ../include/xclass/OX3dLines.h:58: error: ‘_hilightGC’ was not declared in this scope
    main.cc: In member function ‘virtual int OXMain::ProcessMessage(OMessage*)’:
    main.cc:250: error: ‘True’ was not declared in this scope
    make[1]: *** [main.o] Error 1
    make[1]: Leaving directory `/home/DZiolkowski/programs/xclass/x1/xclass-0.8.3/example-app'
    make: *** [all] Error 2
    [DZiolkowski@localhost xclass-0.8.3]$