Learn how easy it is to sync an existing GitHub or Google Code repo to a SourceForge project! See Demo

Close

error copiling wxh in debian 7

Help
2014-02-03
2014-02-03
  • Petra Teghet
    Petra Teghet
    2014-02-03

    Any clue will be welcome!

    tar xjvf wxHexEditor-v0.22-src.tar.bz2
    cd wxHexEditor
    make OPTFLAGS="-fopenmp"

    wx-config --cxx wx-config --cxxflags -Iudis86 -Imhash/include -MMD -O2 -c -fopenmp -O2 src/HexEditorGui.cpp -o src/HexEditorGui.o
    In file included from /usr/include/wx-2.8/wx/window.h:23:0,
    from /usr/include/wx-2.8/wx/sizer.h:17,
    from src/HexEditorGui.h:24,
    from src/HexEditorGui.cpp:18:
    /usr/include/wx-2.8/wx/cursor.h: In constructor 'wxBusyCursorSuspender::wxBusyCursorSuspender()':
    /usr/include/wx-2.8/wx/cursor.h:65:22: error: 'wxIsBusy' was not declared in this scope
    /usr/include/wx-2.8/wx/cursor.h:67:26: error: 'wxBusyCursor' has not been declared
    /usr/include/wx-2.8/wx/cursor.h: In destructor 'wxBusyCursorSuspender::~wxBusyCursorSuspender()':
    /usr/include/wx-2.8/wx/cursor.h:72:22: error: 'wxIsBusy' was not declared in this scope
    /usr/include/wx-2.8/wx/cursor.h:74:26: error: 'wxBusyCursor' has not been declared
    In file included from /usr/include/wx-2.8/wx/window.h:26:0,
    from /usr/include/wx-2.8/wx/sizer.h:17,
    from src/HexEditorGui.h:24,
    from src/HexEditorGui.cpp:18:
    /usr/include/wx-2.8/wx/region.h: In member function 'bool wxRegionBase::Intersect(const wxRect&)':
    /usr/include/wx-2.8/wx/region.h:251:37: error: invalid use of incomplete type 'class wxRegion'
    In file included from /usr/include/wx-2.8/wx/bitmap.h:20:0,
    from /usr/include/wx-2.8/wx/artprov.h:16,
    from src/HexEditorGui.h:11,
    from src/HexEditorGui.cpp:18:
    /usr/include/wx-2.8/wx/gdicmn.h:38:28: error: forward declaration of 'class wxRegion'
    In file included from /usr/include/wx-2.8/wx/window.h:26:0,
    from /usr/include/wx-2.8/wx/sizer.h:17,
    from src/HexEditorGui.h:24,
    from src/HexEditorGui.cpp:18:
    /usr/include/wx-2.8/wx/region.h: In member function 'bool wxRegionBase::Subtract(const wxRect&)':
    /usr/include/wx-2.8/wx/region.h:256:36: error: invalid use of incomplete type 'class wxRegion'
    In file included from /usr/include/wx-2.8/wx/bitmap.h:20:0,
    from /usr/include/wx-2.8/wx/artprov.h:16,
    from src/HexEditorGui.h:11,
    from src/HexEditorGui.cpp:18:
    /usr/include/wx-2.8/wx/gdicmn.h:38:28: error: forward declaration of 'class wxRegion'
    In file included from /usr/include/wx-2.8/wx/window.h:26:0,
    from /usr/include/wx-2.8/wx/sizer.h:17,
    from src/HexEditorGui.h:24,
    from src/HexEditorGui.cpp:18:
    /usr/include/wx-2.8/wx/region.h: In member function 'bool wxRegionBase::Xor(const wxRect&)':
    /usr/include/wx-2.8/wx/region.h:261:31: error: invalid use of incomplete type 'class wxRegion'
    In file included from /usr/include/wx-2.8/wx/bitmap.h:20:0,
    from /usr/include/wx-2.8/wx/artprov.h:16,
    from src/HexEditorGui.h:11,
    from src/HexEditorGui.cpp:18:
    /usr/include/wx-2.8/wx/gdicmn.h:38:28: error: forward declaration of 'class wxRegion'
    In file included from /usr/include/wx-2.8/wx/sizer.h:17:0,
    from src/HexEditorGui.h:24,
    from src/HexEditorGui.cpp:18:
    /usr/include/wx-2.8/wx/window.h: At global scope:
    /usr/include/wx-2.8/wx/window.h:82:12: error: field 'font' has incomplete type
    /usr/include/wx-2.8/wx/window.h:85:14: error: field 'colFg' has incomplete type
    /usr/include/wx-2.8/wx/window.h:89:14: error: field 'colBg' has incomplete type
    /usr/include/wx-2.8/wx/window.h:920:35: error: 'wxUpdateUIEvent' has not been declared
    /usr/include/wx-2.8/wx/window.h:1116:30: error: 'wxSysColourChangedEvent' has not been declared
    /usr/include/wx-2.8/wx/window.h:1117:24: error: 'wxInitDialogEvent' has not been declared
    /usr/include/wx-2.8/wx/window.h:1118:25: error: 'wxMouseEvent' has not been declared
    /usr/include/wx-2.8/wx/window.h:1133:13: error: 'WXWidget' does not name a type
    /usr/include/wx-2.8/wx/window.h:1135:34: error: 'WXWidget' has not been declared
    /usr/include/wx-2.8/wx/window.h:1230:26: error: field 'm_cursor' has incomplete type
    /usr/include/wx-2.8/wx/window.h:1231:26: error: field 'm_font' has incomplete type
    /usr/include/wx-2.8/wx/window.h:1232:26: error: field 'm_backgroundColour' has incomplete type
    /usr/include/wx-2.8/wx/window.h:1233:26: error: field 'm_foregroundColour' has incomplete type
    /usr/include/wx-2.8/wx/window.h:1240:26: error: field 'm_updateRegion' has incomplete type
    /usr/include/wx-2.8/wx/window.h:562:39: error: 'wxNavigationKeyEvent' has not been declared
    /usr/include/wx-2.8/wx/window.h: In member function 'const wxRegion& wxWindowBase::GetUpdateRegion() const':
    /usr/include/wx-2.8/wx/window.h:761:54: error: 'm_updateRegion' was not declared in this scope
    /usr/include/wx-2.8/wx/window.h: In member function 'wxRegion& wxWindowBase::GetUpdateRegion()':
    /usr/include/wx-2.8/wx/window.h:762:42: error: 'm_updateRegion' was not declared in this scope
    /usr/include/wx-2.8/wx/window.h: In member function 'const wxCursor& wxWindowBase::GetCursor() const':
    /usr/include/wx-2.8/wx/window.h:850:48: error: 'm_cursor' was not declared in this scope
    /usr/include/wx-2.8/wx/window.h: In member function 'wxWindow wxWindowBase::GetGrandParent() const':
    /usr/include/wx-2.8/wx/window.h:1547:31: error: invalid use of incomplete type 'class wxWindow'
    In file included from /usr/include/wx-2.8/wx/wx.h:27:0,
    from src/HexEditorGui.cpp:15:
    /usr/include/wx-2.8/wx/utils.h:51:28: error: forward declaration of 'class wxWindow'
    In file included from src/HexEditorGui.h:24:0,
    from src/HexEditorGui.cpp:18:
    /usr/include/wx-2.8/wx/sizer.h: In member function 'void wxSizerItem::SetMinSize(const wxSize&)':
    /usr/include/wx-2.8/wx/sizer.h:292:21: error: invalid use of incomplete type 'class wxWindow'
    In file included from /usr/include/wx-2.8/wx/wx.h:27:0,
    from src/HexEditorGui.cpp:15:
    /usr/include/wx-2.8/wx/utils.h:51:28: error: forward declaration of 'class wxWindow'
    In file included from /usr/include/wx-2.8/wx/frame.h:19:0,
    from src/HexEditorGui.h:25,
    from src/HexEditorGui.cpp:18:
    /usr/include/wx-2.8/wx/toplevel.h: At global scope:
    /usr/include/wx-2.8/wx/toplevel.h:118:49: error: invalid use of incomplete type 'class wxWindow'
    In file included from /usr/include/wx-2.8/wx/wx.h:27:0,
    from src/HexEditorGui.cpp:15:
    /usr/include/wx-2.8/wx/utils.h:51:28: error: forward declaration of 'class wxWindow'
    In file included from /usr/include/wx-2.8/wx/frame.h:19:0,
    from src/HexEditorGui.h:25,
    from src/HexEditorGui.cpp:18:
    /usr/include/wx-2.8/wx/toplevel.h:238:24: error: 'wxCloseEvent' has not been declared
    /usr/include/wx-2.8/wx/toplevel.h:239:17: error: 'wxSizeEvent' has not been declared
    /usr/include/wx-2.8/wx/toplevel.h:246:21: error: 'wxActivateEvent' has not been declared
    /usr/include/wx-2.8/wx/toplevel.h:249:35: error: 'wxUpdateUIEvent' has not been declared
    /usr/include/wx-2.8/wx/toplevel.h: In member function 'virtual bool wxTopLevelWindowBase::IsActive()':
    /usr/include/wx-2.8/wx/toplevel.h:183:68: error: 'FindFocus' was not declared in this scope
    /usr/include/wx-2.8/wx/toplevel.h: In member function 'virtual bool wxTopLevelWindowBase::IsVisible() const':
    /usr/include/wx-2.8/wx/toplevel.h:235:53: error: 'IsShown' was not declared in this scope
    /usr/include/wx-2.8/wx/toplevel.h: In member function 'virtual void wxTopLevelWindowBase::DoGetScreenPosition(int
    , int) const':
    /usr/include/wx-2.8/wx/toplevel.h:273:27: error: 'DoGetPosition' was not declared in this scope
    In file included from src/HexEditorGui.h:25:0,
    from src/HexEditorGui.cpp:18:
    /usr/include/wx-2.8/wx/frame.h: At global scope:
    /usr/include/wx-2.8/wx/frame.h:53:1: error: expected class-name before '{' token
    In file included from /usr/include/wx-2.8/wx/panel.h:15:0,
    from src/HexEditorGui.h:29,
    from src/HexEditorGui.cpp:18:
    /usr/include/wx-2.8/wx/generic/panelg.h:30:36: error: invalid use of incomplete type 'class wxWindow'
    In file included from /usr/include/wx-2.8/wx/wx.h:27:0,
    from src/HexEditorGui.cpp:15:
    /usr/include/wx-2.8/wx/utils.h:51:28: error: forward declaration of 'class wxWindow'
    In file included from /usr/include/wx-2.8/wx/panel.h:15:0,
    from src/HexEditorGui.h:29,
    from src/HexEditorGui.cpp:18:
    /usr/include/wx-2.8/wx/generic/panelg.h:74:17: error: 'wxSizeEvent' has not been declared
    /usr/include/wx-2.8/wx/generic/panelg.h:83:5: error: 'wxChildFocusEvent' has not been declared
    In file included from src/HexEditorGui.h:36:0,
    from src/HexEditorGui.cpp:18:
    /usr/include/wx-2.8/wx/dialog.h:33:1: error: expected class-name before '{' token
    /usr/include/wx-2.8/wx/dialog.h:101:36: error: 'wxKeyEvent' does not name a type
    /usr/include/wx-2.8/wx/dialog.h:101:48: error: ISO C++ forbids declaration of 'event' with no type [-fpermissive]
    /usr/include/wx-2.8/wx/dialog.h:126:21: error: 'wxKeyEvent' has not been declared
    /usr/include/wx-2.8/wx/dialog.h:129:24: error: 'wxCloseEvent' has not been declared
    /usr/include/wx-2.8/wx/dialog.h:132:19: error: 'wxCommandEvent' has not been declared
    /usr/include/wx-2.8/wx/dialog.h:135:29: error: 'wxSysColourChangedEvent' has not been declared
    /usr/include/wx-2.8/wx/dialog.h:140:5: error: 'wxChildFocusEvent' has not been declared
    In file included from src/HexEditorGui.cpp:18:0:
    src/HexEditorGui.h:86:29: error: invalid use of incomplete type 'class wxFrame'
    In file included from /usr/include/wx-2.8/wx/wx.h:27:0,
    from src/HexEditorGui.cpp:15:
    /usr/include/wx-2.8/wx/utils.h:50:28: error: forward declaration of 'class wxFrame'
    In file included from src/HexEditorGui.cpp:18:0:
    src/HexEditorGui.h:92:3: error: 'wxMenu' does not name a type
    src/HexEditorGui.h:93:3: error: 'wxMenu' does not name a type
    src/HexEditorGui.h:94:3: error: 'wxMenu' does not name a type
    src/HexEditorGui.h:95:3: error: 'wxMenu' does not name a type
    src/HexEditorGui.h:96:3: error: 'wxMenu' does not name a type
    src/HexEditorGui.h:97:3: error: 'wxMenu' does not name a type
    src/HexEditorGui.h:98:3: error: 'wxMenu' does not name a type
    src/HexEditorGui.h:99:3: error: 'wxMenu' does not name a type
    src/HexEditorGui.h:100:3: error: 'wxMenu' does not name a type
    src/HexEditorGui.h:101:3: error: 'wxMenu' does not name a type
    src/HexEditorGui.h:102:3: error: 'wxMenu' does not name a type
    src/HexEditorGui.h:104:3: error: 'wxAuiNotebook' does not name a type
    src/HexEditorGui.h:107:25: error: 'wxCloseEvent' has not been declared
    src/HexEditorGui.h:108:27: error: 'wxKeyEvent' has not been declared
    src/HexEditorGui.h:109:29: error: 'wxCommandEvent' has not been declared
    src/HexEditorGui.h:110:24: error: 'wxCommandEvent' has not been declared
    src/HexEditorGui.h:111:28: error: 'wxCommandEvent' has not been declared
    src/HexEditorGui.h:112:28: error: 'wxUpdateUIEvent' has not been declared
    src/HexEditorGui.h:113:29: error: 'wxCommandEvent' has not been declared
    src/HexEditorGui.h:114:31: error: 'wxCommandEvent' has not been declared
    src/HexEditorGui.h:115:31: error: 'wxCommandEvent' has not been declared
    src/HexEditorGui.h:116:28: error: 'wxCommandEvent' has not been declared
    src/HexEditorGui.h: In member function 'virtual void HexEditorGui::OnClose(int&)':
    src/HexEditorGui.h:107:55: error: request for member 'Skip' in 'event', which is of non-class type 'int'
    src/HexEditorGui.h: In member function 'virtual void HexEditorGui::OnKeyDown(int&)':
    src/HexEditorGui.h:108:55: error: request for member 'Skip' in 'event', which is of non-class type 'int'
    src/HexEditorGui.h: In member function 'virtual void HexEditorGui::OnMenuEvent(int&)':
    src/HexEditorGui.h:109:61: error: request for member 'Skip' in 'event', which is of non-class type 'int'
    src/HexEditorGui.h: In member function 'virtual void HexEditorGui::OnQuit(int&)':
    src/HexEditorGui.h:110:56: error: request for member 'Skip' in 'event', which is of non-class type 'int'
    src/HexEditorGui.h: In member function 'virtual void HexEditorGui::OnViewMenu(int&)':
    src/HexEditorGui.h:111:60: error: request for member 'Skip' in 'event', which is of non-class type 'int'
    src/HexEditorGui.h: In member function 'virtual void HexEditorGui::OnUpdateUI(int&)':
    src/HexEditorGui.h:112:61: error: request for member 'Skip' in 'event', which is of non-class type 'int'
    src/HexEditorGui.h: In member function 'virtual void HexEditorGui::OnToolsMenu(int&)':
    src/HexEditorGui.h:113:61: error: request for member 'Skip' in 'event', which is of non-class type 'int'
    src/HexEditorGui.h: In member function 'virtual void HexEditorGui::OnDevicesMenu(int&)':
    src/HexEditorGui.h:114:63: error: request for member 'Skip' in 'event', which is of non-class type 'int'
    src/HexEditorGui.h: In member function 'virtual void HexEditorGui::OnOptionsMenu(int&)':
    src/HexEditorGui.h:115:63: error: request for member 'Skip' in 'event', which is of non-class type 'int'
    src/HexEditorGui.h: In member function 'virtual void HexEditorGui::OnHelpMenu(int&)':
    src/HexEditorGui.h:116:60: error: request for member 'Skip' in 'event', which is of non-class type 'int'
    In file included from src/HexEditorGui.cpp:18:0:
    src/HexEditorGui.h: At global scope:
    src/HexEditorGui.h:135:3: error: 'wxCheckBox' does not name a type
    src/HexEditorGui.h:136:3: error: 'wxCheckBox' does not name a type
    src/HexEditorGui.h:137:3: error: 'wxStaticText' does not name a type
    src/HexEditorGui.h:138:3: error: 'wxTextCtrl' does not name a type
    src/HexEditorGui.h:139:3: error: 'wxCheckBox' does not name a type
    src/HexEditorGui.h:140:3: error: 'wxStaticText' does not name a type
    src/HexEditorGui.h:141:3: error: 'wxTextCtrl' does not name a type
    src/HexEditorGui.h:142:3: error: 'wxStaticText' does not name a type
    src/HexEditorGui.h:143:3: error: 'wxTextCtrl' does not name a type
    src/HexEditorGui.h:144:3: error: 'wxStaticText' does not name a type
    src/HexEditorGui.h:145:3: error: 'wxTextCtrl' does not name a type
    src/HexEditorGui.h:146:3: error: 'wxStaticText' does not name a type
    src/HexEditorGui.h:147:3: error: 'wxTextCtrl' does not name a type
    src/HexEditorGui.h:148:3: error: 'wxStaticText' does not name a type
    src/HexEditorGui.h:149:3: error: 'wxTextCtrl' does not name a type
    src/HexEditorGui.h:150:3: error: 'wxStaticText' does not name a type
    src/HexEditorGui.h:151:3: error: 'wxTextCtrl' does not name a type
    src/HexEditorGui.h:154:26: error: 'wxCommandEvent' has not been declared
    src/HexEditorGui.h:155:28: error: 'wxKeyEvent' has not been declared
    src/HexEditorGui.h:156:29: error: 'wxMouseEvent' has not been declared
    src/HexEditorGui.h:157:29: error: 'wxCommandEvent' has not been declared
    src/HexEditorGui.h: In member function 'virtual void InterpreterGui::OnUpdate(int&)':
    src/HexEditorGui.h:154:58: error: request for member 'Skip' in 'event', which is of non-class type 'int'
    src/HexEditorGui.h: In member function 'virtual void InterpreterGui::OnTextEdit(int&)':
    src/HexEditorGui.h:155:56: error: request for member 'Skip' in 'event', which is of non-class type 'int'
    src/HexEditorGui.h: In member function 'virtual void InterpreterGui::OnTextMouse(int&)':
    src/HexEditorGui.h:156:59: error: request for member 'Skip' in 'event', which is of non-class type 'int'
    src/HexEditorGui.h: In member function 'virtual void InterpreterGui::OnCheckEdit(int&)':
    src/HexEditorGui.h:157:61: error: request for member 'Skip' in 'event', which is of non-class type 'int'
    src/HexEditorGui.h: At global scope:
    src/HexEditorGui.h:175:3: error: 'wxListBox' does not name a type
    src/HexEditorGui.h:179:29: error: 'wxCommandEvent' has not been declared
    src/HexEditorGui.h:180:25: error: 'wxCommandEvent' has not been declared
    src/HexEditorGui.h: In member function 'virtual void TagPanelGui::OnTagSelect(int&)':
    src/HexEditorGui.h:179:61: error: request for member 'Skip' in 'event', which is of non-class type 'int'
    src/HexEditorGui.h: In member function 'virtual void TagPanelGui::OnClear(int&)':
    src/HexEditorGui.h:180:57: error: request for member 'Skip' in 'event', which is of non-class type 'int'
    src/HexEditorGui.h: At global scope:
    src/HexEditorGui.h:198:3: error: 'wxStaticText' does not name a type
    src/HexEditorGui.h:215:3: error: 'wxChoice' does not name a type
    src/HexEditorGui.h:216:3: error: 'wxChoice' does not name a type
    src/HexEditorGui.h:217:3: error: 'wxChoice' does not name a type
    src/HexEditorGui.h:218:3: error: 'wxTextCtrl' does not name a type
    src/HexEditorGui.h:221:26: error: 'wxCommandEvent' has not been declared
    src/HexEditorGui.h: In member function 'virtual void DisassemblerPanelGUI::OnUpdate(int&)':
    src/HexEditorGui.h:221:58: error: request for member 'Skip' in 'event', which is of non-class type 'int'
    src/HexEditorGui.h: At global scope:
    src/HexEditorGui.h:235:1: error: expected class-name before '{' token
    src/HexEditorGui.h:239:3: error: 'wxStaticText' does not name a type
    src/HexEditorGui.h:240:3: error: 'wxChoice' does not name a type
    src/HexEditorGui.h:241:3: error: 'wxComboBox' does not name a type
    src/HexEditorGui.h:242:3: error: 'wxRadioButton' does not name a type
    src/HexEditorGui.h:243:3: error: 'wxRadioButton' does not name a type
    src/HexEditorGui.h:246:3: error: 'wxRadioBox' does not name a type
    src/HexEditorGui.h:250:30: error: 'wxCommandEvent' has not been declared
    src/HexEditorGui.h:251:24: error: 'wxKeyEvent' has not been declared
    src/HexEditorGui.h:252:25: error: 'wxCommandEvent' has not been declared
    src/HexEditorGui.h:253:22: error: 'wxCommandEvent' has not been declared
    src/HexEditorGui.h:254:34: error: 'wxCommandEvent' has not been declared
    src/HexEditorGui.h:255:30: error: 'wxCommandEvent' has not been declared
    src/HexEditorGui.h:256:22: error: 'wxCommandEvent' has not been declared
    src/HexEditorGui.h: In member function 'virtual void GotoDialogGui::EventHandler(int&)':
    src/HexEditorGui.h:250:62: error: request for member 'Skip' in 'event', which is of non-class type 'int'
    src/HexEditorGui.h: In member function 'virtual void GotoDialogGui::OnChar(int&)':
    src/HexEditorGui.h:251:52: error: request for member 'Skip' in 'event', which is of non-class type 'int'
    src/HexEditorGui.h: In member function 'virtual void GotoDialogGui::OnInput(int&)':
    src/HexEditorGui.h:252:57: error: request for member 'Skip' in 'event', which is of non-class type 'int'
    src/HexEditorGui.h: In member function 'virtual void GotoDialogGui::OnGO(int&)':
    src/HexEditorGui.h:253:54: error: request for member 'Skip' in 'event', which is of non-class type 'int'
    src/HexEditorGui.h: In member function 'virtual void GotoDialogGui::OnPreviousSector(int&)':
    src/HexEditorGui.h:254:66: error: request for member 'Skip' in 'event', which is of non-class type 'int'
    src/HexEditorGui.h: In member function 'virtual void GotoDialogGui::OnNextSector(int&)':
    src/HexEditorGui.h:255:62: error: request for member 'Skip' in 'event', which is of non-class type 'int'
    src/HexEditorGui.h: In member function 'virtual void GotoDialogGui::OnGo(int&)':
    src/HexEditorGui.h:256:54: error: request for member 'Skip' in 'event', which is of non-class type 'int'
    src/HexEditorGui.h: At global scope:
    src/HexEditorGui.h:270:1: error: expected class-name before '{' token
    src/HexEditorGui.h:274:3: error: 'wxStaticText' does not name a type
    src/HexEditorGui.h:275:3: error: 'wxComboBox' does not name a type
    src/HexEditorGui.h:276:3: error: 'wxStaticText' does not name a type
    src/HexEditorGui.h:277:3: error: 'wxComboBox' does not name a type
    src/HexEditorGui.h:278:3: error: 'wxRadioBox' does not name a type
    src/HexEditorGui.h:279:3: error: 'wxCheckBox' does not name a type
    src/HexEditorGui.h:280:3: error: 'wxCheckBox' does not name a type
    src/HexEditorGui.h:281:3: error: 'wxCheckBox' does not name a type
    src/HexEditorGui.h:282:3: error: 'wxCheckBox' does not name a type
    src/HexEditorGui.h:286:3: error: 'wxStaticLine' does not name a type
    src/HexEditorGui.h:292:24: error: 'wxKeyEvent' has not been declared
    src/HexEditorGui.h:293:30: error: 'wxCommandEvent' has not been declared
    src/HexEditorGui.h: In member function 'virtual void FindDialogGui::OnChar(int&)':
    src/HexEditorGui.h:292:52: error: request for member 'Skip' in 'event', which is of non-class type 'int'
    src/HexEditorGui.h: In member function 'virtual void FindDialogGui::EventHandler(int&)':
    src/HexEditorGui.h:293:62: error: request for member 'Skip' in 'event', which is of non-class type 'int'
    src/HexEditorGui.h: At global scope:
    src/HexEditorGui.h:307:1: error: expected class-name before '{' token
    src/HexEditorGui.h:311:3: error: 'wxStaticBitmap' does not name a type
    src/HexEditorGui.h:312:3: error: 'wxStaticText' does not name a type
    src/HexEditorGui.h:313:3: error: 'wxHyperlinkCtrl' does not name a type
    src/HexEditorGui.h:314:3: error: 'wxCheckBox' does not name a type
    src/HexEditorGui.h:317:30: error: 'wxCommandEvent' has not been declared
    src/HexEditorGui.h: In member function 'virtual void UpdateDialogGui::OnChkDisplay(int&)':
    src/HexEditorGui.h:317:62: error: request for member 'Skip' in 'event', which is of non-class type 'int'
    src/HexEditorGui.h: At global scope:
    src/HexEditorGui.h:331:1: error: expected class-name before '{' token
    src/HexEditorGui.h:335:3: error: 'wxStaticText' does not name a type
    src/HexEditorGui.h:336:3: error: 'wxFilePickerCtrl' does not name a type
    src/HexEditorGui.h:337:3: error: 'wxStaticText' does not name a type
    src/HexEditorGui.h:338:3: error: 'wxFilePickerCtrl' does not name a type
    src/HexEditorGui.h:339:3: error: 'wxRadioButton' does not name a type
    src/HexEditorGui.h:340:3: error: 'wxRadioButton' does not name a type
    src/HexEditorGui.h:341:3: error: 'wxCheckBox' does not name a type
    src/HexEditorGui.h:342:3: error: 'wxSpinCtrl' does not name a type
    src/HexEditorGui.h:343:3: error: 'wxStaticText' does not name a type
    src/HexEditorGui.h:344:3: error: 'wxCheckBox' does not name a type
    src/HexEditorGui.h:345:3: error: 'wxSpinCtrl' does not name a type
    src/HexEditorGui.h:346:3: error: 'wxStaticText' does not name a type
    src/HexEditorGui.h:347:3: error: 'wxCheckBox' does not name a type
    src/HexEditorGui.h:348:3: error: 'wxFilePickerCtrl' does not name a type
    src/HexEditorGui.h:353:30: error: 'wxFileDirPickerEvent' has not been declared
    src/HexEditorGui.h:354:30: error: 'wxCommandEvent' has not been declared
    src/HexEditorGui.h:355:43: error: 'wxFileDirPickerEvent' has not been declared
    src/HexEditorGui.h: In member function 'virtual void CompareDialogGui::OnFileChange(int&)':
    src/HexEditorGui.h:353:68: error: request for member 'Skip' in 'event', which is of non-class type 'int'
    src/HexEditorGui.h: In member function 'virtual void CompareDialogGui::EventHandler(int&)':
    src/HexEditorGui.h:354:62: error: request for member 'Skip' in 'event', which is of non-class type 'int'
    src/HexEditorGui.h: In member function 'virtual void CompareDialogGui::filePickSaveOnFileChanged(int&)':
    src/HexEditorGui.h:355:81: error: request for member 'Skip' in 'event', which is of non-class type 'int'
    src/HexEditorGui.h: At global scope:
    src/HexEditorGui.h:369:1: error: expected class-name before '{' token
    src/HexEditorGui.h:373:3: error: 'wxStaticText' does not name a type
    src/HexEditorGui.h:374:3: error: 'wxCheckBox' does not name a type
    src/HexEditorGui.h:375:3: error: 'wxFilePickerCtrl' does not name a type
    src/HexEditorGui.h:376:3: error: 'wxCheckBox' does not name a type
    src/HexEditorGui.h:377:3: error: 'wxCheckBox' does not name a type
    src/HexEditorGui.h:378:3: error: 'wxCheckBox' does not name a type
    src/HexEditorGui.h:379:3: error: 'wxCheckBox' does not name a type
    src/HexEditorGui.h:380:3: error: 'wxCheckBox' does not name a type
    src/HexEditorGui.h:381:3: error: 'wxCheckBox' does not name a type
    src/HexEditorGui.h:382:3: error: 'wxCheckBox' does not name a type
    src/HexEditorGui.h:383:3: error: 'wxCheckBox' does not name a type
    src/HexEditorGui.h:384:3: error: 'wxCheckBox' does not name a type
    src/HexEditorGui.h:385:3: error: 'wxCheckBox' does not name a type
    src/HexEditorGui.h:386:3: error: 'wxCheckBox' does not name a type
    src/HexEditorGui.h:387:3: error: 'wxCheckBox' does not name a type
    src/HexEditorGui.h:388:3: error: 'wxCheckBox' does not name a type
    src/HexEditorGui.h:389:3: error: 'wxCheckBox' does not name a type
    src/HexEditorGui.h:390:3: error: 'wxCheckBox' does not name a type
    src/HexEditorGui.h:391:3: error: 'wxCheckBox' does not name a type
    src/HexEditorGui.h:392:3: error: 'wxCheckBox' does not name a type
    src/HexEditorGui.h:393:3: error: 'wxCheckBox' does not name a type
    src/HexEditorGui.h:394:3: error: 'wxCheckBox' does not name a type
    src/HexEditorGui.h:395:3: error: 'wxCheckBox' does not name a type
    src/HexEditorGui.h:396:3: error: 'wxCheckBox' does not name a type
    src/HexEditorGui.h:397:3: error: 'wxCheckBox' does not name a type
    src/HexEditorGui.h:398:3: error: 'wxCheckBox' does not name a type
    src/HexEditorGui.h:399:3: error: 'wxCheckBox' does not name a type
    src/HexEditorGui.h:400:3: error: 'wxCheckBox' does not name a type
    src/HexEditorGui.h:401:3: error: 'wxCheckBox' does not name a type
    src/HexEditorGui.h:402:3: error: 'wxCheckBox' does not name a type
    src/HexEditorGui.h:407:30: error: 'wxCommandEvent' has not been declared
    src/HexEditorGui.h:408:30: error: 'wxFileDirPickerEvent' has not been declared
    src/HexEditorGui.h: In member function 'virtual void ChecksumDialogGui::EventHandler(int&)':
    src/HexEditorGui.h:407:62: error: request for member 'Skip' in 'event', which is of non-class type 'int'
    src/HexEditorGui.h: In member function 'virtual void ChecksumDialogGui::OnFileChange(int&)':
    src/HexEditorGui.h:408:68: error: request for member 'Skip' in 'event', which is of non-class type 'int'
    src/HexEditorGui.h: At global scope:
    src/HexEditorGui.h:422:1: error: expected class-name before '{' token
    src/HexEditorGui.h:426:3: error: 'wxStaticText' does not name a type
    src/HexEditorGui.h:427:3: error: 'wxChoice' does not name a type
    src/HexEditorGui.h:428:3: error: 'wxStaticText' does not name a type
    src/HexEditorGui.h:429:3: error: 'wxChoice' does not name a type
    src/HexEditorGui.h:430:3: error: 'wxCheckBox' does not name a type
    src/HexEditorGui.h:431:3: error: 'wxSpinCtrl' does not name a type
    src/HexEditorGui.h:432:3: error: 'wxCheckBox' does not name a type
    src/HexEditorGui.h:433:3: error: 'wxCheckBox' does not name a type
    src/HexEditorGui.h:434:3: error: 'wxCheckBox' does not name a type
    src/HexEditorGui.h:439:30: error: 'wxCommandEvent' has not been declared
    src/HexEditorGui.h: In member function 'virtual void CopyAsDialogGui::EventHandler(int&)':
    src/HexEditorGui.h:439:62: error: request for member 'Skip' in 'event', which is of non-class type 'int'
    src/HexEditorGui.h: At global scope:
    src/HexEditorGui.h:453:1: error: expected class-name before '{' token
    src/HexEditorGui.h:457:3: error: 'wxStaticText' does not name a type
    src/HexEditorGui.h:458:3: error: 'wxStaticText' does not name a type
    src/HexEditorGui.h:459:3: error: 'wxRadioButton' does not name a type
    src/HexEditorGui.h:460:3: error: 'wxRadioButton' does not name a type
    src/HexEditorGui.h:461:3: error: 'wxTextCtrl' does not name a type
    src/HexEditorGui.h:466:30: error: 'wxCommandEvent' has not been declared
    src/HexEditorGui.h: In member function 'virtual void XORViewDialogGui::EventHandler(int&)':
    src/HexEditorGui.h:466:62: error: request for member 'Skip' in 'event', which is of non-class type 'int'
    src/HexEditorGui.h: At global scope:
    src/HexEditorGui.h:480:1: error: expected class-name before '{' token
    src/HexEditorGui.h:484:3: error: 'wxStaticText' does not name a type
    src/HexEditorGui.h:485:3: error: 'wxColourPickerCtrl' does not name a type
    src/HexEditorGui.h:486:3: error: 'wxColourPickerCtrl' does not name a type
    src/HexEditorGui.h:487:3: error: 'wxColourPickerCtrl' does not name a type
    src/HexEditorGui.h:488:3: error: 'wxStaticText' does not name a type
    src/HexEditorGui.h:489:3: error: 'wxColourPickerCtrl' does not name a type
    src/HexEditorGui.h:490:3: error: 'wxColourPickerCtrl' does not name a type
    src/HexEditorGui.h:492:3: error: 'wxStaticText' does not name a type
    src/HexEditorGui.h:493:3: error: 'wxChoice' does not name a type
    src/HexEditorGui.h:494:3: error: 'wxStaticText' does not name a type
    src/HexEditorGui.h:495:3: error: 'wxChoice' does not name a type
    src/HexEditorGui.h:496:3: error: 'wxStaticText' does not name a type
    src/HexEditorGui.h:497:3: error: 'wxChoice' does not name a type
    src/HexEditorGui.h:498:3: error: 'wxStaticText' does not name a type
    src/HexEditorGui.h:499:3: error: 'wxSpinCtrl' does not name a type
    src/HexEditorGui.h:500:3: error: 'wxComboBox' does not name a type
    src/HexEditorGui.h:501:3: error: 'wxCheckBox' does not name a type
    src/HexEditorGui.h:502:3: error: 'wxCheckBox' does not name a type
    src/HexEditorGui.h:503:3: error: 'wxSpinCtrl' does not name a type
    src/HexEditorGui.h:504:3: error: 'wxCheckBox' does not name a type
    src/HexEditorGui.h:509:32: error: 'wxCommandEvent' has not been declared
    src/HexEditorGui.h:510:30: error: 'wxCommandEvent' has not been declared
    src/HexEditorGui.h:511:34: error: 'wxSpinEvent' has not been declared
    src/HexEditorGui.h:512:34: error: 'wxCommandEvent' has not been declared
    src/HexEditorGui.h:513:24: error: 'wxCommandEvent' has not been declared
    src/HexEditorGui.h: In member function 'virtual void PreferencesDialogGui::OnResetColours(int&)':
    src/HexEditorGui.h:509:64: error: request for member 'Skip' in 'event', which is of non-class type 'int'
    src/HexEditorGui.h: In member function 'virtual void PreferencesDialogGui::EventHandler(int&)':
    src/HexEditorGui.h:510:62: error: request for member 'Skip' in 'event', which is of non-class type 'int'
    src/HexEditorGui.h: In member function 'virtual void PreferencesDialogGui::SpinEventHandler(int&)':
    src/HexEditorGui.h:511:63: error: request for member 'Skip' in 'event', which is of non-class type 'int'
    src/HexEditorGui.h: In member function 'virtual void PreferencesDialogGui::OnCustomHexCheck(int&)':
    src/HexEditorGui.h:512:66: error: request for member 'Skip' in 'event', which is of non-class type 'int'
    src/HexEditorGui.h: In member function 'virtual void PreferencesDialogGui::OnSave(int&)':
    src/HexEditorGui.h:513:56: error: request for member 'Skip' in 'event', which is of non-class type 'int'
    src/HexEditorGui.h: At global scope:
    src/HexEditorGui.h:527:1: error: expected class-name before '{' token
    src/HexEditorGui.h:531:3: error: 'wxStaticText' does not name a type
    src/HexEditorGui.h:532:3: error: 'wxChoice' does not name a type
    src/HexEditorGui.h:533:3: error: 'wxStaticText' does not name a type
    src/HexEditorGui.h:534:3: error: 'wxFilePickerCtrl' does not name a type
    src/HexEditorGui.h:539:26: error: 'wxCommandEvent' has not been declared
    src/HexEditorGui.h: In member function 'virtual void DeviceBackupDialogGui::OnBackup(int&)':
    src/HexEditorGui.h:539:58: error: request for member 'Skip' in 'event', which is of non-class type 'int'
    src/HexEditorGui.h: At global scope:
    src/HexEditorGui.h:553:1: error: expected class-name before '{' token
    src/HexEditorGui.h:557:3: error: 'wxStaticText' does not name a type
    src/HexEditorGui.h:558:3: error: 'wxFilePickerCtrl' does not name a type
    src/HexEditorGui.h:559:3: error: 'wxStaticText' does not name a type
    src/HexEditorGui.h:560:3: error: 'wxChoice' does not name a type
    src/HexEditorGui.h:565:27: error: 'wxCommandEvent' has not been declared
    src/HexEditorGui.h: In member function 'virtual void DeviceRestoreDialogGui::OnRestore(int&)':
    src/HexEditorGui.h:565:59: error: request for member 'Skip' in 'event', which is of non-class type 'int'
    src/HexEditorGui.h: At global scope:
    src/HexEditorGui.h:579:1: error: expected class-name before '{' token
    src/HexEditorGui.h:583:3: error: 'wxStaticText' does not name a type
    src/HexEditorGui.h:584:3: error: 'wxChoice' does not name a type
    src/HexEditorGui.h:585:3: error: 'wxRadioBox' does not name a type
    src/HexEditorGui.h:590:25: error: 'wxCommandEvent' has not been declared
    src/HexEditorGui.h: In member function 'virtual void DeviceEraseDialogGui::OnErase(int&)':
    src/HexEditorGui.h:590:57: error: request for member 'Skip' in 'event', which is of non-class type 'int'
    src/HexEditorGui.h: At global scope:
    src/HexEditorGui.h:603:27: error: invalid use of incomplete type 'class wxFrame'
    In file included from /usr/include/wx-2.8/wx/wx.h:27:0,
    from src/HexEditorGui.cpp:15:
    /usr/include/wx-2.8/wx/utils.h:50:28: error: forward declaration of 'class wxFrame'
    In file included from src/HexEditorGui.cpp:18:0:
    src/HexEditorGui.h:610:3: error: 'wxTextCtrl' does not name a type
    src/HexEditorGui.h:622:1: error: expected class-name before '{' token
    src/HexEditorGui.h:626:3: error: 'wxStaticBitmap' does not name a type
    src/HexEditorGui.h:627:3: error: 'wxStaticText' does not name a type
    src/HexEditorGui.h:628:3: error: 'wxStaticText' does not name a type
    src/HexEditorGui.cpp: In constructor 'HexEditorGui::HexEditorGui(wxWindow
    , wxWindowID, const wxString&, const wxPoint&, const wxSize&, long int)':
    src/HexEditorGui.cpp:22:140: error: type 'wxFrame' is not a direct base of 'HexEditorGui'
    src/HexEditorGui.cpp:24:8: error: 'class HexEditorGui' has no member named 'SetSizeHints'
    src/HexEditorGui.cpp:26:26: error: invalid use of incomplete type 'class wxMenuBar'
    In file included from src/HexEditorGui.h:25:0,
    from src/HexEditorGui.cpp:18:
    /usr/include/wx-2.8/wx/frame.h:26:28: error: forward declaration of 'class wxMenuBar'
    src/HexEditorGui.cpp:27:2: error: 'fileMenu' was not declared in this scope
    src/HexEditorGui.cpp:27:17: error: expected type-specifier before 'wxMenu'
    src/HexEditorGui.cpp:27:17: error: expected ';' before 'wxMenu'
    src/HexEditorGui.cpp:28:2: error: 'wxMenuItem' was not declared in this scope
    src/HexEditorGui.cpp:28:14: error: 'menuFileNew' was not declared in this scope
    src/HexEditorGui.cpp:29:20: error: expected type-specifier before 'wxMenuItem'
    src/HexEditorGui.cpp:29:20: error: expected ';' before 'wxMenuItem'
    src/HexEditorGui.cpp:32:14: error: 'menuFileOpen' was not declared in this scope
    src/HexEditorGui.cpp:33:21: error: expected type-specifier before 'wxMenuItem'
    src/HexEditorGui.cpp:33:21: error: expected ';' before 'wxMenuItem'
    src/HexEditorGui.cpp:36:2: error: 'menuFileOpenRecent' was not declared in this scope
    src/HexEditorGui.cpp:36:27: error: expected type-specifier before 'wxMenu'
    src/HexEditorGui.cpp:36:27: error: expected ';' before 'wxMenu'
    src/HexEditorGui.cpp:37:14: error: 'menuFileOpenRecentDummy' was not declared in this scope
    src/HexEditorGui.cpp:38:32: error: expected type-specifier before 'wxMenuItem'
    src/HexEditorGui.cpp:38:32: error: expected ';' before 'wxMenuItem'
    src/HexEditorGui.cpp:44:14: error: 'menuFileSave' was not declared in this scope
    src/HexEditorGui.cpp:45:21: error: expected type-specifier before 'wxMenuItem'
    src/HexEditorGui.cpp:45:21: error: expected ';' before 'wxMenuItem'
    src/HexEditorGui.cpp:49:14: error: 'menuFileSaveAs' was not declared in this scope
    src/HexEditorGui.cpp:50:23: error: expected type-specifier before 'wxMenuItem'
    src/HexEditorGui.cpp:50:23: error: expected ';' before 'wxMenuItem'
    src/HexEditorGui.cpp:54:14: error: 'menuFileClose' was not declared in this scope
    src/HexEditorGui.cpp:55:22: error: expected type-specifier before 'wxMenuItem'
    src/HexEditorGui.cpp:55:22: error: expected ';' before 'wxMenuItem'
    src/HexEditorGui.cpp:61:14: error: 'menuFileImportTAG' was not declared in this scope
    src/HexEditorGui.cpp:62:26: error: expected type-specifier before 'wxMenuItem'
    src/HexEditorGui.cpp:62:26: error: expected ';' before 'wxMenuItem'
    src/HexEditorGui.cpp:65:14: error: 'menuFileExportTAG' was not declared in this scope
    src/HexEditorGui.cpp:66:26: error: expected type-specifier before 'wxMenuItem'
    src/HexEditorGui.cpp:66:26: error: expected ';' before 'wxMenuItem'
    src/HexEditorGui.cpp:71:14: error: 'menuFileQuit' was not declared in this scope
    src/HexEditorGui.cpp:72:21: error: expected type-specifier before 'wxMenuItem'
    src/HexEditorGui.cpp:72:21: error: expected ';' before 'wxMenuItem'
    src/HexEditorGui.cpp:75:6: error: invalid use of incomplete type 'class wxMenuBar'
    In file included from src/HexEditorGui.h:25:0,
    from src/HexEditorGui.cpp:18:
    /usr/include/wx-2.8/wx/frame.h:26:28: error: forward declaration of 'class wxMenuBar'
    src/HexEditorGui.cpp:77:2: error: 'editMenu' was not declared in this scope
    src/HexEditorGui.cpp:77:17: error: expected type-specifier before 'wxMenu'
    src/HexEditorGui.cpp:77:17: error: expected ';' before 'wxMenu'
    src/HexEditorGui.cpp:78:14: error: 'menuEditUndo' was not declared in this scope
    src/HexEditorGui.cpp:79:21: error: expected type-specifier before 'wxMenuItem'
    src/HexEditorGui.cpp:79:21: error: expected ';' before 'wxMenuItem'
    src/HexEditorGui.cpp:83:14: error: 'menuEditRedo' was not declared in this scope
    src/HexEditorGui.cpp:84:21: error: expected type-specifier before 'wxMenuItem'
    src/HexEditorGui.cpp:84:21: error: expected ';' before 'wxMenuItem'
    src/HexEditorGui.cpp:90:14: error: 'menuEditCopy' was not declared in this scope
    src/HexEditorGui.cpp:91:21: error: expected type-specifier before 'wxMenuItem'
    src/HexEditorGui.cpp:91:21: error: expected ';' before 'wxMenuItem'
    src/HexEditorGui.cpp:95:14: error: 'menuEditCopyAs' was not declared in this scope
    src/HexEditorGui.cpp:96:23: error: expected type-specifier before 'wxMenuItem'
    src/HexEditorGui.cpp:96:23: error: expected ';' before 'wxMenuItem'
    src/HexEditorGui.cpp:100:14: error: 'menuEditSaveAsDump' was not declared in this scope
    src/HexEditorGui.cpp:101:27: error: expected type-specifier before 'wxMenuItem'
    src/HexEditorGui.cpp:101:27: error: expected ';' before 'wxMenuItem'
    src/HexEditorGui.cpp:105:14: error: 'menuEditCut' was not declared in this scope
    src/HexEditorGui.cpp:106:20: error: expected type-specifier before 'wxMenuItem'
    src/HexEditorGui.cpp:106:20: error: expected ';' before 'wxMenuItem'
    src/HexEditorGui.cpp:110:14: error: 'menuEditPaste' was not declared in this scope
    src/HexEditorGui.cpp:111:22: error: expected type-specifier before 'wxMenuItem'
    src/HexEditorGui.cpp:111:22: error: expected ';' before 'wxMenuItem'
    src/HexEditorGui.cpp:115:14: error: 'menuEditFill' was not declared in this scope
    src/HexEditorGui.cpp:116:21: error: expected type-specifier before 'wxMenuItem'
    src/HexEditorGui.cpp:116:21: error: expected ';' before 'wxMenuItem'
    src/HexEditorGui.cpp:120:14: error: 'menuEditDelete' was not declared in this scope
    src/HexEditorGui.cpp:121:23: error: expected type-specifier before 'wxMenuItem'
    src/HexEditorGui.cpp:121:23: error: expected ';' before 'wxMenuItem'
    src/HexEditorGui.cpp:125:14: error: 'menuEditInsert' was not declared in this scope
    src/HexEditorGui.cpp:126:23: error: expected type-specifier before 'wxMenuItem'
    src/HexEditorGui.cpp:126:23: error: expected ';' before 'wxMenuItem'
    src/HexEditorGui.cpp:132:14: error: 'menuEditFind' was not declared in this scope
    src/HexEditorGui.cpp:133:21: error: expected type-specifier before 'wxMenuItem'
    src/HexEditorGui.cpp:133:21: error: expected ';' before 'wxMenuItem'
    src/HexEditorGui.cpp:137:14: error: 'menuEditReplace' was not declared in this scope
    src/HexEditorGui.cpp:138:24: error: expected type-specifier before 'wxMenuItem'
    src/HexEditorGui.cpp:138:24: error: expected ';' before 'wxMenuItem'
    src/HexEditorGui.cpp:142:14: error: 'menuEditGotooffset' was not declared in this scope
    src/HexEditorGui.cpp:143:27: error: expected type-specifier before 'wxMenuItem'
    src/HexEditorGui.cpp:143:27: error: expected ';' before 'wxMenuItem'
    src/HexEditorGui.cpp:147:6: error: invalid use of incomplete type 'class wxMenuBar'
    In file included from src/HexEditorGui.h:25:0,
    from src/HexEditorGui.cpp:18:
    /usr/include/wx-2.8/wx/frame.h:26:28: error: forward declaration of 'class wxMenuBar'
    src/HexEditorGui.cpp:149:2: error: 'viewMenu' was not declared in this scope
    src/HexEditorGui.cpp:149:17: error: expected type-specifier before 'wxMenu'
    src/HexEditorGui.cpp:149:17: error: expected ';' before 'wxMenu'
    src/HexEditorGui.cpp:150:14: error: 'menuViewInterprater' was not declared in this scope
    src/HexEditorGui.cpp:151:28: error: expected type-specifier before 'wxMenuItem'
    src/HexEditorGui.cpp:151:28: error: expected ';' before 'wxMenuItem'
    src/HexEditorGui.cpp:154:14: error: 'menuViewToolbar' was not declared in this scope
    src/HexEditorGui.cpp:155:24: error: expected type-specifier before 'wxMenuItem'
    src/HexEditorGui.cpp:155:24: error: expected ';' before 'wxMenuItem'
    src/HexEditorGui.cpp:158:14: error: 'menuViewInfopanel' was not declared in this scope
    src/HexEditorGui.cpp:159:26: error: expected type-specifier before 'wxMenuItem'
    src/HexEditorGui.cpp:159:26: error: expected ';' before 'wxMenuItem'
    src/HexEditorGui.cpp:162:14: error: 'menuViewTagPanel' was not declared in this scope
    src/HexEditorGui.cpp:163:25: error: expected type-specifier before 'wxMenuItem'
    src/HexEditorGui.cpp:163:25: error: expected ';' before 'wxMenuItem'
    src/HexEditorGui.cpp:166:14: error: 'menuViewDisassemblerPanel' was not declared in this scope
    src/HexEditorGui.cpp:167:34: error: expected type-specifier before 'wxMenuItem'
    src/HexEditorGui.cpp:167:34: error: expected ';' before 'wxMenuItem'
    src/HexEditorGui.cpp:170:14: error: 'menuViewSearchPanel' was not declared in this scope
    src/HexEditorGui.cpp:171:28: error: expected type-specifier before 'wxMenuItem'
    src/HexEditorGui.cpp:171:28: error: expected ';' before 'wxMenuItem'
    src/HexEditorGui.cpp:174:14: error: 'menuViewComparisonPanel' was not declared in this scope
    src/HexEditorGui.cpp:175:32: error: expected type-specifier before 'wxMenuItem'
    src/HexEditorGui.cpp:175:32: error: expected ';' before 'wxMenuItem'
    src/HexEditorGui.cpp:180:14: error: 'menuViewZebra' was not declared in this scope
    src/HexEditorGui.cpp:181:22: error: expected type-specifier before 'wxMenuItem'
    src/HexEditorGui.cpp:181:22: error: expected ';' before 'wxMenuItem'
    src/HexEditorGui.cpp:186:14: error: 'menuViewOffset' was not declared in this scope
    src/HexEditorGui.cpp:187:23: error: expected type-specifier before 'wxMenuItem'
    src/HexEditorGui.cpp:187:23: error: expected ';' before 'wxMenuItem'
    src/HexEditorGui.cpp:191:14: error: 'menuViewHex' was not declared in this scope
    src/HexEditorGui.cpp:192:20: error: expected type-specifier before 'wxMenuItem'
    src/HexEditorGui.cpp:192:20: error: expected ';' before 'wxMenuItem'
    src/HexEditorGui.cpp:196:14: error: 'menuViewText' was not declared in this scope
    src/HexEditorGui.cpp:197:21: error: expected type-specifier before 'wxMenuItem'
    src/HexEditorGui.cpp:197:21: error: expected ';' before 'wxMenuItem'
    src/HexEditorGui.cpp:201:6: error: invalid use of incomplete type 'class wxMenuBar'
    In file included from src/HexEditorGui.h:25:0,
    from src/HexEditorGui.cpp:18:
    /usr/include/wx-2.8/wx/frame.h:26:28: error: forward declaration of 'class wxMenuBar'
    src/HexEditorGui.cpp:203:2: error: 'toolsMenu' was not declared in this scope
    src/HexEditorGui.cpp:203:18: error: expected type-specifier before 'wxMenu'
    src/HexEditorGui.cpp:203:18: error: expected ';' before 'wxMenu'
    src/HexEditorGui.cpp:204:14: error: 'menuToolChecksum' was not declared in this scope
    src/HexEditorGui.cpp:205:25: error: expected type-specifier before 'wxMenuItem'
    src/HexEditorGui.cpp:205:25: error: expected ';' before 'wxMenuItem'
    src/HexEditorGui.cpp:208:14: error: 'menuToolCompare' was not declared in this scope
    src/HexEditorGui.cpp:209:24: error: expected type-specifier before 'wxMenuItem'
    src/HexEditorGui.cpp:209:24: error: expected ';' before 'wxMenuItem'
    src/HexEditorGui.cpp:212:14: error: 'menuToolsXORView' was not declared in this scope
    src/HexEditorGui.cpp:213:25: error: expected type-specifier before 'wxMenuItem'
    src/HexEditorGui.cpp:213:25: error: expected ';' before 'wxMenuItem'
    src/HexEditorGui.cpp:216:6: error: invalid use of incomplete type 'class wxMenuBar'
    In file included from src/HexEditorGui.h:25:0,
    from src/HexEditorGui.cpp:18:
    /usr/include/wx-2.8/wx/frame.h:26:28: error: forward declaration of 'class wxMenuBar'
    src/HexEditorGui.cpp:218:2: error: 'devicesMenu' was not declared in this scope
    src/HexEditorGui.cpp:218:20: error: expected type-specifier before 'wxMenu'
    src/HexEditorGui.cpp:218:20: error: expected ';' before 'wxMenu'
    src/HexEditorGui.cpp:219:14: error: 'menuDevicesRam' was not declared in this scope
    src/HexEditorGui.cpp:220:23: error: expected type-specifier before 'wxMenuItem'
    src/HexEditorGui.cpp:220:23: error: expected ';' before 'wxMenuItem'
    src/HexEditorGui.cpp:224:2: error: 'menuDeviceDisk' was not declared in this scope
    src/HexEditorGui.cpp:224:23: error: expected type-specifier before 'wxMenu'
    src/HexEditorGui.cpp:224:23: error: expected ';' before 'wxMenu'
    src/HexEditorGui.cpp:225:14: error: 'menuDevicesDiskItem1' was not declared in this scope
    src/HexEditorGui.cpp:226:29: error: expected type-specifier before 'wxMenuItem'
    src/HexEditorGui.cpp:226:29: error: expected ';' before 'wxMenuItem'
    src/HexEditorGui.cpp:231:14: error: 'menuDevicesProcessRAM' was not declared in this scope
    src/HexEditorGui.cpp:232:30: error: expected type-specifier before 'wxMenuItem'
    src/HexEditorGui.cpp:232:30: error: expected ';' before 'wxMenuItem'
    src/HexEditorGui.cpp:238:2: error: 'menuDeviceImage' was not declared in this scope
    src/HexEditorGui.cpp:238:24: error: expected type-specifier before 'wxMenu'
    src/HexEditorGui.cpp:238:24: error: expected ';' before 'wxMenu'
    src/HexEditorGui.cpp:239:14: error: 'menuDeviceBackup' was not declared in this scope
    src/HexEditorGui.cpp:240:25: error: expected type-specifier before 'wxMenuItem'
    src/HexEditorGui.cpp:240:25: error: expected ';' before 'wxMenuItem'
    src/HexEditorGui.cpp:243:14: error: 'menuDeviceRestore' was not declared in this scope
    src/HexEditorGui.cpp:244:26: error: expected type-specifier before 'wxMenuItem'
    src/HexEditorGui.cpp:244:26: error: expected ';' before 'wxMenuItem'
    src/HexEditorGui.cpp:247:14: error: 'menuDeviceErase' was not declared in this scope
    src/HexEditorGui.cpp:248:24: error: expected type-specifier before 'wxMenuItem'
    src/HexEditorGui.cpp:248:24: error: expected ';' before 'wxMenuItem'
    src/HexEditorGui.cpp:253:6: error: invalid use of incomplete type 'class wxMenuBar'
    In file included from src/HexEditorGui.h:25:0,
    from src/HexEditorGui.cpp:18:
    /usr/include/wx-2.8/wx/frame.h:26:28: error: forward declaration of 'class wxMenuBar'
    src/HexEditorGui.cpp:255:2: error: 'optionsMenu' was not declared in this scope
    src/HexEditorGui.cpp:255:20: error: expected type-specifier before 'wxMenu'
    src/HexEditorGui.cpp:255:20: error: expected ';' before 'wxMenu'
    src/HexEditorGui.cpp:256:2: error: 'menuOptionsFileMode' was not declared in this scope
    src/HexEditorGui.cpp:256:28: error: expected type-specifier before 'wxMenu'
    src/HexEditorGui.cpp:256:28: error: expected ';' before 'wxMenu'
    src/HexEditorGui.cpp:257:14: error: 'menuOptionsFileModeRO' was not declared in this scope
    src/HexEditorGui.cpp:258:30: error: expected type-specifier before 'wxMenuItem'
    src/HexEditorGui.cpp:258:30: error: expected ';' before 'wxMenuItem'
    src/HexEditorGui.cpp:263:14: error: 'menuOptionsFileModeRW' was not declared in this scope
    src/HexEditorGui.cpp:264:30: error: expected type-specifier before 'wxMenuItem'
    src/HexEditorGui.cpp:264:30: error: expected ';' before 'wxMenuItem'
    src/HexEditorGui.cpp:268:14: error: 'menuOptionsFileModeDW' was not declared in this scope
    src/HexEditorGui.cpp:269:30: error: expected type-specifier before 'wxMenuItem'
    src/HexEditorGui.cpp:269:30: error: expected ';' before 'wxMenuItem'
    src/HexEditorGui.cpp:275:14: error: 'menuOptionsPreferences' was not declared in this scope
    src/HexEditorGui.cpp:276:31: error: expected type-specifier before 'wxMenuItem'
    src/HexEditorGui.cpp:276:31: error: expected ';' before 'wxMenuItem'
    src/HexEditorGui.cpp:279:6: error: invalid use of incomplete type 'class wxMenuBar'
    In file included from src/HexEditorGui.h:25:0,
    from src/HexEditorGui.cpp:18:
    /usr/include/wx-2.8/wx/frame.h:26:28: error: forward declaration of 'class wxMenuBar'
    src/HexEditorGui.cpp:281:2: error: 'helpMenu' was not declared in this scope
    src/HexEditorGui.cpp:281:17: error: expected type-specifier before 'wxMenu'
    src/HexEditorGui.cpp:281:17: error: expected ';' before 'wxMenu'
    src/HexEditorGui.cpp:282:14: error: 'menuHelpDonate' was not declared in this scope
    src/HexEditorGui.cpp:283:23: error: expected type-specifier before 'wxMenuItem'
    src/HexEditorGui.cpp:283:23: error: expected ';' before 'wxMenuItem'
    src/HexEditorGui.cpp:286:14: error: 'menuHelpBugReporting' was not declared in this scope
    src/HexEditorGui.cpp:287:29: error: expected type-specifier before 'wxMenuItem'
    src/HexEditorGui.cpp:287:29: error: expected ';' before 'wxMenuItem'
    src/HexEditorGui.cpp:290:14: error: 'menuHelpAbout' was not declared in this scope
    src/HexEditorGui.cpp:291:22: error: expected type-specifier before 'wxMenuItem'
    src/HexEditorGui.cpp:291:22: error: expected ';' before 'wxMenuItem'
    src/HexEditorGui.cpp:294:6: error: invalid use of incomplete type 'class wxMenuBar'
    In file included from src/HexEditorGui.h:25:0,
    from src/HexEditorGui.cpp:18:
    /usr/include/wx-2.8/wx/frame.h:26:28: error: forward declaration of 'class wxMenuBar'
    src/HexEditorGui.cpp:296:8: error: 'class HexEditorGui' has no member named 'SetMenuBar'
    src/HexEditorGui.cpp:298:20: error: 'class HexEditorGui' has no member named 'CreateStatusBar'
    src/HexEditorGui.cpp:299:11: error: invalid use of incomplete type 'class wxStatusBar'
    In file included from src/HexEditorGui.h:25:0,
    from src/HexEditorGui.cpp:18:
    /usr/include/wx-2.8/wx/frame.h:27:28: error: forward declaration of 'class wxStatusBar'
    src/HexEditorGui.cpp:299:66: error: invalid use of incomplete type 'class wxFont'
    In file included from /usr/include/wx-2.8/wx/bitmap.h:20:0,
    from /usr/include/wx-2.8/wx/artprov.h:16,
    from src/HexEditorGui.h:11,
    from src/HexEditorGui.cpp:18:
    /usr/include/wx-2.8/wx/gdicmn.h:34:28: error: forward declaration of 'class wxFont'
    src/HexEditorGui.cpp:304:2: error: 'MyNotebook' was not declared in this scope
    src/HexEditorGui.cpp:304:19: error: expected type-specifier before 'wxAuiNotebook'
    src/HexEditorGui.cpp:304:19: error: expected ';' before 'wxAuiNotebook'
    src/HexEditorGui.cpp:309:8: error: 'class HexEditorGui' has no member named 'SetSizer'
    src/HexEditorGui.cpp:310:8: error: 'class HexEditorGui' has no member named 'Layout'
    src/HexEditorGui.cpp:311:24: error: no matching function for call to 'wxBoxSizer::Fit(HexEditorGui const)'
    src/HexEditorGui.cpp:311:24: note: candidate is:
    In file included from src/HexEditorGui.h:24:0,
    from src/HexEditorGui.cpp:18:
    /usr/include/wx-2.8/wx/sizer.h:570:12: note: wxSize wxSizer::Fit(wxWindow
    )
    /usr/include/wx-2.8/wx/sizer.h:570:12: note: no known conversion for argument 1 from 'HexEditorGui const' to 'wxWindow'
    src/HexEditorGui.cpp:314:8: error: 'class HexEditorGui' has no member named 'Connect'
    src/HexEditorGui.cpp:314:80: error: 'wxCloseEventHandler' was not declared in this scope
    src/HexEditorGui.cpp:315:8: error: 'class HexEditorGui' has no member named 'Connect'
    src/HexEditorGui.cpp:315:76: error: 'wxKeyEventHandler' was not declared in this scope
    src/HexEditorGui.cpp:316:8: error: 'class HexEditorGui' has no member named 'Connect'
    src/HexEditorGui.cpp:316:117: error: 'wxCommandEventHandler' was not declared in this scope
    src/HexEditorGui.cpp:317:8: error: 'class HexEditorGui' has no member named 'Connect'
    src/HexEditorGui.cpp:318:8: error: 'class HexEditorGui' has no member named 'Connect'
    src/HexEditorGui.cpp:319:8: error: 'class HexEditorGui' has no member named 'Connect'
    src/HexEditorGui.cpp:320:8: error: 'class HexEditorGui' has no member named 'Connect'
    src/HexEditorGui.cpp:321:8: error: 'class HexEditorGui' has no member named 'Connect'
    src/HexEditorGui.cpp:322:8: error: 'class HexEditorGui' has no member named 'Connect'
    src/HexEditorGui.cpp:323:8: error: 'class HexEditorGui' has no member named 'Connect'
    src/HexEditorGui.cpp:324:8: error: 'class HexEditorGui' has no member named 'Connect'
    src/HexEditorGui.cpp:325:8: error: 'class HexEditorGui' has no member named 'Connect'
    src/HexEditorGui.cpp:326:8: error: 'class HexEditorGui' has no member named 'Connect'
    src/HexEditorGui.cpp:327:8: error: 'class HexEditorGui' has no member named 'Connect'
    src/HexEditorGui.cpp:328:8: error: 'class HexEditorGui' has no member named 'Connect'
    src/HexEditorGui.cpp:329:8: error: 'class HexEditorGui' has no member named 'Connect'
    src/HexEditorGui.cpp:330:8: error: 'class HexEditorGui' has no member named 'Connect'
    src/HexEditorGui.cpp:331:8: error: 'class HexEditorGui' has no member named 'Connect'
    src/HexEditorGui.cpp:332:8: error: 'class HexEditorGui' has no member named 'Connect'
    src/HexEditorGui.cpp:333:8: error: 'class HexEditorGui' has no member named 'Connect'
    src/HexEditorGui.cpp:334:8: error: 'class HexEditorGui' has no member named 'Connect'
    src/HexEditorGui.cpp:335:8: error: 'class HexEditorGui' has no member named 'Connect'
    src/HexEditorGui.cpp:336:8: error: 'class HexEditorGui' has no member named 'Connect'
    src/HexEditorGui.cpp:337:8: error: 'class HexEditorGui' has no member named 'Connect'
    src/HexEditorGui.cpp:338:8: error: 'class HexEditorGui' has no member named 'Connect'
    src/HexEditorGui.cpp:339:8: error: 'class HexEditorGui' has no member named 'Connect'
    src/HexEditorGui.cpp:339:113: error: 'wxUpdateUIEventHandler' was not declared in this scope
    src/HexEditorGui.cpp:340:8: error: 'class HexEditorGui' has no member named 'Connect'
    src/HexEditorGui.cpp:341:8: error: 'class HexEditorGui' has no member named 'Connect'
    src/HexEditorGui.cpp:342:8: error: 'class HexEditorGui' has no member named 'Connect'
    src/HexEditorGui.cpp:343:8: error: 'class HexEditorGui' has no member named 'Connect'
    src/HexEditorGui.cpp:344:8: error: 'class HexEditorGui' has no member named 'Connect'
    src/HexEditorGui.cpp:345:8: error: 'class HexEditorGui' has no member named 'Connect'
    src/HexEditorGui.cpp:346:8: error: 'class HexEditorGui' has no member named 'Connect'
    src/HexEditorGui.cpp:347:8: error: 'class HexEditorGui' has no member named 'Connect'
    src/HexEditorGui.cpp:348:8: error: 'class HexEditorGui' has no member named 'Connect'
    src/HexEditorGui.cpp:349:8: error: 'class HexEditorGui' has no member named 'Connect'
    src/HexEditorGui.cpp:350:8: error: 'class HexEditorGui' has no member named 'Connect'
    src/HexEditorGui.cpp:351:8: error: 'class HexEditorGui' has no member named 'Connect'
    src/HexEditorGui.cpp:352:8: error: 'class HexEditorGui' has no member named 'Connect'
    src/HexEditorGui.cpp:353:8: error: 'class HexEditorGui' has no member named 'Connect'
    src/HexEditorGui.cpp:354:8: error: 'class HexEditorGui' has no member named 'Connect'
    src/HexEditorGui.cpp:355:8: error: 'class HexEditorGui' has no member named 'Connect'
    src/HexEditorGui.cpp:356:8: error: 'class HexEditorGui' has no member named 'Connect'
    src/HexEditorGui.cpp:357:8: error: 'class HexEditorGui' has no member named 'Connect'
    src/HexEditorGui.cpp:358:8: error: 'class HexEditorGui' has no member named 'Connect'
    src/HexEditorGui.cpp:359:8: error: 'class HexEditorGui' has no member named 'Connect'
    src/HexEditorGui.cpp:360:8: error: 'class HexEditorGui' has no member named 'Connect'
    src/HexEditorGui.cpp:361:8: error: 'class HexEditorGui' has no member named 'Connect'
    src/HexEditorGui.cpp:362:8: error: 'class HexEditorGui' has no member named 'Connect'
    src/HexEditorGui.cpp:363:8: error: 'class HexEditorGui' has no member named 'Connect'
    src/HexEditorGui.cpp:364:8: error: 'class HexEditorGui' has no member named 'Connect'
    src/HexEditorGui.cpp:365:8: error: 'class HexEditorGui' has no member named 'Connect'
    src/HexEditorGui.cpp:366:8: error: 'class HexEditorGui' has no member named 'Connect'
    src/HexEditorGui.cpp:367:8: error: 'class HexEditorGui' has no member named 'Connect'
    src/HexEditorGui.cpp:368:8: error: 'class HexEditorGui' has no member named 'Connect'
    src/HexEditorGui.cpp:369:8: error: 'class HexEditorGui' has no member named 'Connect'
    src/HexEditorGui.cpp:370:8: error: 'class HexEditorGui' has no member named 'Connect'
    src/HexEditorGui.cpp:371:8: error: 'class HexEditorGui' has no member named 'Connect'
    src/HexEditorGui.cpp:372:8: error: 'class HexEditorGui' has no member named 'Connect'
    src/HexEditorGui.cpp:373:8: error: 'class HexEditorGui' has no member named 'Connect'
    src/HexEditorGui.cpp: In destructor 'HexEditorGui::~HexEditorGui()':
    src/HexEditorGui.cpp:379:8: error: 'class HexEditorGui' has no member named 'Disconnect'
    src/HexEditorGui.cpp:379:83: error: 'wxCloseEventHandler' was not declared in this scope
    src/HexEditorGui.cpp:380:8: error: 'class HexEditorGui' has no member named 'Disconnect'
    src/HexEditorGui.cpp:380:79: error: 'wxKeyEventHandler' was not declared in this scope
    src/HexEditorGui.cpp:381:8: error: 'class HexEditorGui' has no member named 'Disconnect'
    src/HexEditorGui.cpp:381:108: error: 'wxCommandEventHandler' was not declared in this scope
    src/HexEditorGui.cpp:382:8: error: 'class HexEditorGui' has no member named 'Disconnect'
    src/HexEditorGui.cpp:383:8: error: 'class HexEditorGui' has no member named 'Disconnect'
    src/HexEditorGui.cpp:384:8: error: 'class HexEditorGui' has no member named 'Disconnect'
    src/HexEditorGui.cpp:385:8: error: 'class HexEditorGui' has no member named 'Disconnect'
    src/HexEditorGui.cpp:386:8: error: 'class HexEditorGui' has no member named 'Disconnect'
    src/HexEditorGui.cpp:387:8: error: 'class HexEditorGui' has no member named 'Disconnect'
    src/HexEditorGui.cpp:388:8: error: 'class HexEditorGui' has no member named 'Disconnect'
    src/HexEditorGui.cpp:389:8: error: 'class HexEditorGui' has no member named 'Disconnect'
    src/HexEditorGui.cpp:390:8: error: 'class HexEditorGui' has no member named 'Disconnect'
    src/HexEditorGui.cpp:391:8: error: 'class HexEditorGui' has no member named 'Disconnect'
    src/HexEditorGui.cpp:392:8: error: 'class HexEditorGui' has no member named 'Disconnect'
    src/HexEditorGui.cpp:393:8: error: 'class HexEditorGui' has no member named 'Disconnect'
    src/HexEditorGui.cpp:394:8: error: 'class HexEditorGui' has no member named 'Disconnect'
    src/HexEditorGui.cpp:395:8: error: 'class HexEditorGui' has no member named 'Disconnect'
    src/HexEditorGui.cpp:396:8: error: 'class HexEditorGui' has no member named 'Disconnect'
    src/HexEditorGui.cpp:397:8: error: 'class HexEditorGui' has no member named 'Disconnect'
    src/HexEditorGui.cpp:398:8: error: 'class HexEditorGui' has no member named 'Disconnect'
    src/HexEditorGui.cpp:399:8: error: 'class HexEditorGui' has no member named 'Disconnect'
    src/HexEditorGui.cpp:400:8: error: 'class HexEditorGui' has no member named 'Disconnect'
    src/HexEditorGui.cpp:401:8: error: 'class HexEditorGui' has no member named 'Disconnect'
    src/HexEditorGui.cpp:402:8: error: 'class HexEditorGui' has no member named 'Disconnect'
    src/HexEditorGui.cpp:403:8: error: 'class HexEditorGui' has no member named 'Disconnect'
    src/HexEditorGui.cpp:404:8: error: 'class HexEditorGui' has no member named 'Disconnect'
    src/HexEditorGui.cpp:404:101: error: 'wxUpdateUIEventHandler' was not declared in this scope
    src/HexEditorGui.cpp:405:8: error: 'class HexEditorGui' has no member named 'Disconnect'
    src/HexEditorGui.cpp:406:8: error: 'class HexEditorGui' has no member named 'Disconnect'
    src/HexEditorGui.cpp:407:8: error: 'class HexEditorGui' has no member named 'Disconnect'
    src/HexEditorGui.cpp:408:8: error: 'class HexEditorGui' has no member named 'Disconnect'
    src/HexEditorGui.cpp:409:8: error: 'class HexEditorGui' has no member named 'Disconnect'
    src/HexEditorGui.cpp:410:8: error: 'class HexEditorGui' has no member named 'Disconnect'
    src/HexEditorGui.cpp:411:8: error: 'class HexEditorGui' has no member named 'Disconnect'
    src/HexEditorGui.cpp:412:8: error: 'class HexEditorGui' has no member named 'Disconnect'
    src/HexEditorGui.cpp:413:8: error: 'class HexEditorGui' has no member named 'Disconnect'
    src/HexEditorGui.cpp:414:8: error: 'class HexEditorGui' has no member named 'Disconnect'
    src/HexEditorGui.cpp:415:8: error: 'class HexEditorGui' has no member named 'Disconnect'
    src/HexEditorGui.cpp:416:8: error: 'class HexEditorGui' has no member named 'Disconnect'
    src/HexEditorGui.cpp:417:8: error: 'class HexEditorGui' has no member named 'Disconnect'
    src/HexEditorGui.cpp:418:8: error: 'class HexEditorGui' has no member named 'Disconnect'
    src/HexEditorGui.cpp:419:8: error: 'class HexEditorGui' has no member named 'Disconnect'
    src/HexEditorGui.cpp:420:8: error: 'class HexEditorGui' has no member named 'Disconnect'
    src/HexEditorGui.cpp:421:8: error: 'class HexEditorGui' has no member named 'Disconnect'
    src/HexEditorGui.cpp:422:8: error: 'class HexEditorGui' has no member named 'Disconnect'
    src/HexEditorGui.cpp:423:8: error: 'class HexEditorGui' has no member named 'Disconnect'
    src/HexEditorGui.cpp:424:8: error: 'class HexEditorGui' has no member named 'Disconnect'
    src/HexEditorGui.cpp:425:8: error: 'class HexEditorGui' has no member named 'Disconnect'
    src/HexEditorGui.cpp:426:8: error: 'class HexEditorGui' has no member named 'Disconnect'
    src/HexEditorGui.cpp:427:8: error: 'class HexEditorGui' has no member named 'Disconnect'
    src/HexEditorGui.cpp:428:8: error: 'class HexEditorGui' has no member named 'Disconnect'
    src/HexEditorGui.cpp:429:8: error: 'class HexEditorGui' has no member named 'Disconnect'
    src/HexEditorGui.cpp:430:8: error: 'class HexEditorGui' has no member named 'Disconnect'
    src/HexEditorGui.cpp:431:8: error: 'class HexEditorGui' has no member named 'Disconnect'
    src/HexEditorGui.cpp:432:8: error: 'class HexEditorGui' has no member named 'Disconnect'
    src/HexEditorGui.cpp:433:8: error: 'class HexEditorGui' has no member named 'Disconnect'
    src/HexEditorGui.cpp:434:8: error: 'class HexEditorGui' has no member named 'Disconnect'
    src/HexEditorGui.cpp:435:8: error: 'class HexEditorGui' has no member named 'Disconnect'
    src/HexEditorGui.cpp:436:8: error: 'class HexEditorGui' has no member named 'Disconnect'
    src/HexEditorGui.cpp:437:8: error: 'class HexEditorGui' has no member named 'Disconnect'
    src/HexEditorGui.cpp:438:8: error: 'class HexEditorGui' has no member named 'Disconnect'
    src/HexEditorGui.cpp: In constructor 'InterpreterGui::InterpreterGui(wxWindow, wxWindowID, const wxPoint&, const wxSize&, long int)':
    src/HexEditorGui.cpp:450:2: error: 'm_check_unsigned' was not declared in this scope
    src/HexEditorGui.cpp:450:25: error: expected type-specifier before 'wxCheckBox'
    src/HexEditorGui.cpp:450:25: error: expected ';' before 'wxCheckBox'
    src/HexEditorGui.cpp:451:69: error: invalid use of incomplete type 'class wxFont'
    In file included from /usr/include/wx-2.8/wx/bitmap.h:20:0,
    from /usr/include/wx-2.8/wx/artprov.h:16,
    from src/HexEditorGui.h:11,
    from src/HexEditorGui.cpp:18:
    /usr/include/wx-2.8/wx/gdicmn.h:34:28: error: forward declaration of 'class wxFont'
    src/HexEditorGui.cpp:455:2: error: 'm_check_bigendian' was not declared in this scope
    src/HexEditorGui.cpp:455:26: error: expected type-specifier before 'wxCheckBox'
    src/HexEditorGui.cpp:455:26: error: expected ';' before 'wxCheckBox'
    src/HexEditorGui.cpp:456:74: error: invalid use of incomplete type 'class wxFont'
    In file included from /usr/include/wx-2.8/wx/bitmap.h:20:0,
    from /usr/include/wx-2.8/wx/artprov.h:16,
    from src/HexEditorGui.h:11,
    from src/HexEditorGui.cpp:18:
    /usr/include/wx-2.8/wx/gdicmn.h:34:28: error: forward declaration of 'class wxFont'
    src/HexEditorGui.cpp:468:2: error: 'm_static_bin' was not declared in this scope
    src/HexEditorGui.cpp:468:21: error: expected type-specifier before 'wxStaticText'
    src/HexEditorGui.cpp:468:21: error: expected ';' before 'wxStaticText'
    src/HexEditorGui.cpp:470:69: error: invalid use of incomplete type 'class wxFont'
    In file included from /usr/include/wx-2.8/wx/bitmap.h:20:0,
    from /usr/include/wx-2.8/wx/artprov.h:16,
    from src/HexEditorGui.h:11,
    from src/HexEditorGui.cpp:18:
    /usr/include/wx-2.8/wx/gdicmn.h:34:28: error: forward declaration of 'class wxFont'
    src/HexEditorGui.cpp:477:2: error: 'm_textctrl_binary' was not declared in this scope
    src/HexEditorGui.cpp:477:26: error: expected type-specifier before 'wxTextCtrl'
    src/HexEditorGui.cpp:477:26: error: expected ';' before 'wxTextCtrl'
    src/HexEditorGui.cpp:479:74: error: invalid use of incomplete type 'class wxFont'
    In file included from /usr/include/wx-2.8/wx/bitmap.h:20:0,
    from /usr/include/wx-2.8/wx/artprov.h:16,
    from src/HexEditorGui.h:11,
    from src/HexEditorGui.cpp:18:
    /usr/include/wx-2.8/wx/gdicmn.h:34:28: error: forward declaration of 'class wxFont'
    src/HexEditorGui.cpp:484:2: error: 'm_check_edit' was not declared in this scope
    src/HexEditorGui.cpp:484:21: error: expected type-specifier before 'wxCheckBox'
    src/HexEditorGui.cpp:484:21: error: expected ';' before 'wxCheckBox'
    src/HexEditorGui.cpp:485:69: error: invalid use of incomplete type 'class wxFont'
    In file included from /usr/include/wx-2.8/wx/bitmap.h:20:0,
    from /usr/include/wx-2.8/wx/artprov.h:16,
    from src/HexEditorGui.h:11,
    from src/HexEditorGui.cpp:18:
    /usr/include/wx-2.8/wx/gdicmn.h:34:28: error: forward declaration of 'class wxFont'
    src/HexEditorGui.cpp:493:2: error: 'm_static_8bit' was not declared in this scope
    src/HexEditorGui.cpp:493:22: error: expected type-specifier before 'wxStaticText'
    src/HexEditorGui.cpp:493:22: error: expected ';' before 'wxStaticText'
    src/HexEditorGui.cpp:495:70: error: invalid use of incomplete type 'class wxFont'
    In file included from /usr/include/wx-2.8/wx/bitmap.h:20:0,
    from /usr/include/wx-2.8/wx/artprov.h:16,
    from src/HexEditorGui.h:11,
    from src/HexEditorGui.cpp:18:
    /usr/include/wx-2.8/wx/gdicmn.h:34:28: error: forward declaration of 'class wxFont'
    src/HexEditorGui.cpp:499:2: error: 'm_textctrl_8bit' was not declared in this scope
    src/HexEditorGui.cpp:499:24: error: expected type-specifier before 'wxTextCtrl'
    src/HexEditorGui.cpp:499:24: error: expected ';' before 'wxTextCtrl'
    src/HexEditorGui.cpp:500:72: error: invalid use of incomplete type 'class wxFont'
    In file included from /usr/include/wx-2.8/wx/bitmap.h:20:0,
    from /usr/include/wx-2.8/wx/artprov.h:16,
    from src/HexEditorGui.h:11,
    from src/HexEditorGui.cpp:18:
    /usr/include/wx-2.8/wx/gdicmn.h:34:28: error: forward declaration of 'class wxFont'
    src/HexEditorGui.cpp:504:2: error: 'm_static_16bit' was not declared in this scope
    src/HexEditorGui.cpp:504:23: error: expected type-specifier before 'wxStaticText'
    src/HexEditorGui.cpp:504:23: error: expected ';' before 'wxStaticText'
    src/HexEditorGui.cpp:506:71: error: invalid use of incomplete type 'class wxFont'
    In file included from /usr/include/wx-2.8/wx/bitmap.h:20:0,
    from /usr/include/wx-2.8/wx/artprov.h:16,
    from src/HexEditorGui.h:11,
    from src/HexEditorGui.cpp:18:
    /usr/include/wx-2.8/wx/gdicmn.h:34:28: error: forward declaration of 'class wxFont'
    src/HexEditorGui.cpp:510:2: error: 'm_textctrl_16bit' was not declared in this scope
    src/HexEditorGui.cpp:510:25: error: expected type-specifier before 'wxTextCtrl'
    src/HexEditorGui.cpp:510:25: error: expected ';' before 'wxTextCtrl'
    src/HexEditorGui.cpp:511:73: error: invalid use of incomplete type 'class wxFont'
    In file included from /usr/include/wx-2.8/wx/bitmap.h:20:0,
    from /usr/include/wx-2.8/wx/artprov.h:16,
    from src/HexEditorGui.h:11,
    from src/HexEditorGui.cpp:18:
    /usr/include/wx-2.8/wx/gdicmn.h:34:28: error: forward declaration of 'class wxFont'
    src/HexEditorGui.cpp:515:2: error: 'm_static_32bit' was not declared in this scope
    src/HexEditorGui.cpp:515:23: error: expected type-specifier before 'wxStaticText'
    src/HexEditorGui.cpp:515:23: error: expected ';' before 'wxStaticText'
    src/HexEditorGui.cpp:517:71: error: invalid use of incomplete type 'class wxFont'
    In file included from /usr/include/wx-2.8/wx/bitmap.h:20:0,
    from /usr/include/wx-2.8/wx/artprov.h:16,
    from src/HexEditorGui.h:11,
    from src/HexEditorGui.cpp:18:
    /usr/include/wx-2.8/wx/gdicmn.h:34:28: error: forward declaration of 'class wxFont'
    src/HexEditorGui.cpp:521:2: error: 'm_textctrl_32bit' was not declared in this scope
    src/HexEditorGui.cpp:521:25: error: expected type-specifier before 'wxTextCtrl'
    src/HexEditorGui.cpp:521:25: error: expected ';' before 'wxTextCtrl'
    src/HexEditorGui.cpp:522:73: error: invalid use of incomplete type 'class wxFont'
    In file included from /usr/include/wx-2.8/wx/bitmap.h:20:0,
    from /usr/include/wx-2.8/wx/artprov.h:16,
    from src/HexEditorGui.h:11,
    from src/HexEditorGui.cpp:18:
    /usr/include/wx-2.8/wx/gdicmn.h:34:28: error: forward declaration of 'class wxFont'
    src/HexEditorGui.cpp:526:2: error: 'm_static_64bit' was not declared in this scope
    src/HexEditorGui.cpp:526:23: error: expected type-specifier before 'wxStaticText'
    src/HexEditorGui.cpp:526:23: error: expected ';' before 'wxStaticText'
    src/HexEditorGui.cpp:528:71: error: invalid use of incomplete type 'class wxFont'
    In file included from /usr/include/wx-2.8/wx/bitmap.h:20:0,
    from /usr/include/wx-2.8/wx/artprov.h:16,
    from src/HexEditorGui.h:11,
    from src/HexEditorGui.cpp:18:
    /usr/include/wx-2.8/wx/gdicmn.h:34:28: error: forward declaration of 'class wxFont'
    src/HexEditorGui.cpp:532:2: error: 'm_textctrl_64bit' was not declared in this scope
    src/HexEditorGui.cpp:532:25: error: expected type-specifier before 'wxTextCtrl'
    src/HexEditorGui.cpp:532:25: error: expected ';' before 'wxTextCtrl'
    src/HexEditorGui.cpp:533:73: error: invalid use of incomplete type 'class wxFont'
    In file included from /usr/include/wx-2.8/wx/bitmap.h:20:0,
    from /usr/include/wx-2.8/wx/artprov.h:16,
    from src/HexEditorGui.h:11,
    from src/HexEditorGui.cpp:18:
    /usr/include/wx-2.8/wx/gdicmn.h:34:28: error: forward declaration of 'class wxFont'
    src/HexEditorGui.cpp:537:2: error: 'm_static_float' was not declared in this scope
    src/HexEditorGui.cpp:537:23: error: expected type-specifier before 'wxStaticText'
    src/HexEditorGui.cpp:537:23: error: expected ';' before 'wxStaticText'
    src/HexEditorGui.cpp:539:71: error: invalid use of incomplete type 'class wxFont'
    In file included from /usr/include/wx-2.8/wx/bitmap.h:20:0,
    from /usr/include/wx-2.8/wx/artprov.h:16,
    from src/HexEditorGui.h:11,
    from src/HexEditorGui.cpp:18:
    /usr/include/wx-2.8/wx/gdicmn.h:34:28: error: forward declaration of 'class wxFont'
    src/HexEditorGui.cpp:543:2: error: 'm_textctrl_float' was not declared in this scope
    src/HexEditorGui.cpp:543:25: error: expected type-specifier before 'wxTextCtrl'
    src/HexEditorGui.cpp:543:25: error: expected ';' before 'wxTextCtrl'
    src/HexEditorGui.cpp:544:73: error: invalid use of incomplete type 'class wxFont'
    In file included from /usr/include/wx-2.8/wx/bitmap.h:20:0,
    from /usr/include/wx-2.8/wx/artprov.h:16,
    from src/HexEditorGui.h:11,
    from src/HexEditorGui.cpp:18:
    /usr/include/wx-2.8/wx/gdicmn.h:34:28: error: forward declaration of 'class wxFont'
    src/HexEditorGui.cpp:548:2: error: 'm_static_double' was not declared in this scope
    src/HexEditorGui.cpp:548:24: error: expected type-specifier before 'wxStaticText'
    src/HexEditorGui.cpp:548:24: error: expected ';' before 'wxStaticText'
    src/HexEditorGui.cpp:550:72: error: invalid use of incomplete type 'class wxFont'
    In file included from /usr/include/wx-2.8/wx/bitmap.h:20:0,
    from /usr/include/wx-2.8/wx/artprov.h:16,
    from src/HexEditorGui.h:11,
    from src/HexEditorGui.cpp:18:
    /usr/include/wx-2.8/wx/gdicmn.h:34:28: error: forward declaration of 'class wxFont'
    src/HexEditorGui.cpp:554:2: error: 'm_textctrl_double' was not declared in this scope
    src/HexEditorGui.cpp:554:26: error: expected type-specifier before 'wxTextCtrl'
    src/HexEditorGui.cpp:554:26: error: expected ';' before 'wxTextCtrl'
    src/HexEditorGui.cpp:555:74: error: invalid use of incomplete type 'class wxFont'
    In file included from /usr/include/wx-2.8/wx/bitmap.h:20:0,
    from /usr/include/wx-2.8/wx/artprov.h:16,
    from src/HexEditorGui.h:11,
    from src/HexEditorGui.cpp:18:
    /usr/include/wx-2.8/wx/gdicmn.h:34:28: error: forward declaration of 'class wxFont'
    src/HexEditorGui.cpp:563:8: error: 'class InterpreterGui' has no member named 'SetSizer'
    src/HexEditorGui.cpp:564:8: error: 'class InterpreterGui' has no member named 'Layout'
    src/HexEditorGui.cpp:567:109: error: 'wxCommandEventHandler' was not declared in this scope
    src/HexEditorGui.cpp:569:88: error: 'wxKeyEventHandler' was not declared in this scope
    src/HexEditorGui.cpp:570:100: error: 'wxMouseEventHandler' was not declared in this scope
    src/HexEditorGui.cpp: In destructor 'virtual InterpreterGui::~InterpreterGui()':
    src/HexEditorGui.cpp:582:2: error: 'm_check_unsigned' was not declared in this scope
    src/HexEditorGui.cpp:582:112: error: 'wxCommandEventHandler' was not declared in this scope
    src/HexEditorGui.cpp:583:2: error: 'm_check_bigendian' was not declared in this scope
    src/HexEditorGui.cpp:584:2: error: 'm_textctrl_binary' was not declared in this scope
    src/HexEditorGui.cpp:584:91: error: 'wxKeyEventHandler' was not declared in this scope
    src/HexEditorGui.cpp:585:103: error: 'wxMouseEventHandler' was not declared in this scope
    src/HexEditorGui.cpp:591:2: error: 'm_check_edit' was not declared in this scope
    src/HexEditorGui.cpp: In constructor 'TagPanelGui::TagPanelGui(wxWindow
    , wxWindowID, const wxPoint&, const wxSize&, long int)':
    src/HexEditorGui.cpp:600:2: error: 'TagPanelList' was not declared in this scope
    src/HexEditorGui.cpp:600:21: error: expected type-specifier before 'wxListBox'
    src/HexEditorGui.cpp:600:21: error: expected ';' before 'wxListBox'
    src/HexEditorGui.cpp:603:96: error: invalid use of incomplete type 'class wxButton'
    In file included from src/HexEditorGui.h:24:0,
    from src/HexEditorGui.cpp:18:
    /usr/include/wx-2.8/wx/sizer.h:23:28: error: forward declaration of 'class wxButton'
    src/HexEditorGui.cpp:604:15: error: invalid use of incomplete type 'class wxButton'
    In file included from src/HexEditorGui.h:24:0,
    from src/HexEditorGui.cpp:18:
    /usr/include/wx-2.8/wx/sizer.h:23:28: error: forward declaration of 'class wxButton'
    src/HexEditorGui.cpp:606:97: error: invalid conversion from 'wxButton' to 'int' [-fpermissive]
    In file included from src/HexEditorGui.h:24:0,
    from src/HexEditorGui.cpp:18:
    /usr/include/wx-2.8/wx/sizer.h:956:1: error: initializing argument 1 of 'wxSizerItem
    wxSizer::Add(int, int, int, int, int, wxObject)' [-fpermissive]
    src/HexEditorGui.cpp:609:8: error: 'class TagPanelGui' has no member named 'SetSizer'
    src/HexEditorGui.cpp:610:8: error: 'class TagPanelGui' has no member named 'Layout'
    src/HexEditorGui.cpp:611:22: error: no matching function for call to 'wxBoxSizer::Fit(TagPanelGui
    const)'
    src/HexEditorGui.cpp:611:22: note: candidate is:
    In file included from src/HexEditorGui.h:24:0,
    from src/HexEditorGui.cpp:18:
    /usr/include/wx-2.8/wx/sizer.h:570:12: note: wxSize wxSizer::Fit(wxWindow)
    /usr/include/wx-2.8/wx/sizer.h:570:12: note: no known conversion for argument 1 from 'TagPanelGui
    const' to 'wxWindow'
    src/HexEditorGui.cpp:614:105: error: 'wxCommandEventHandler' was not declared in this scope
    src/HexEditorGui.cpp:615:15: error: invalid use of incomplete type 'class wxButton'
    In file included from src/HexEditorGui.h:24:0,
    from src/HexEditorGui.cpp:18:
    /usr/include/wx-2.8/wx/sizer.h:23:28: error: forward declaration of 'class wxButton'
    src/HexEditorGui.cpp: In destructor 'virtual TagPanelGui::~TagPanelGui()':
    src/HexEditorGui.cpp:621:2: error: 'TagPanelList' was not declared in this scope
    src/HexEditorGui.cpp:621:108: error: 'wxCommandEventHandler' was not declared in this scope
    src/HexEditorGui.cpp:622:15: error: invalid use of incomplete type 'class wxButton'
    In file included from src/HexEditorGui.h:24:0,
    from src/HexEditorGui.cpp:18:
    /usr/include/wx-2.8/wx/sizer.h:23:28: error: forward declaration of 'class wxButton'
    src/HexEditorGui.cpp: In constructor 'InfoPanelGui::InfoPanelGui(wxWindow
    , wxWindowID, const wxPoint&, const wxSize&, long int)':
    src/HexEditorGui.cpp:631:2: error: 'm_InfoPanelText' was not declared in this scope
    src/HexEditorGui.cpp:631:24: error: expected type-specifier before 'wxStaticText'
    src/HexEditorGui.cpp:631:24: error: expected ';' before 'wxStaticText'
    src/HexEditorGui.cpp:636:8: error: 'class InfoPanelGui' has no member named 'SetSizer'
    src/HexEditorGui.cpp:637:8: error: 'class InfoPanelGui' has no member named 'Layout'
    src/HexEditorGui.cpp: In constructor 'DisassemblerPanelGUI::DisassemblerPanelGUI(wxWindow, wxWindowID, const wxPoint&, const wxSize&, long int)':
    src/HexEditorGui.cpp:654:2: error: 'm_choiceVendor' was not declared in this scope
    src/HexEditorGui.cpp:654:23: error: expected type-specifier before 'wxChoice'
    src/HexEditorGui.cpp:654:23: error: expected ';' before 'wxChoice'
    src/HexEditorGui.cpp:656:48: error: invalid use of incomplete type 'const class wxFont'
    In file included from /usr/include/wx-2.8/wx/bitmap.h:20:0,
    from /usr/include/wx-2.8/wx/artprov.h:16,
    from src/HexEditorGui.h:11,
    from src/HexEditorGui.cpp:18:
    /usr/include/wx-2.8/wx/gdicmn.h:34:28: error: forward declaration of 'const class wxFont'
    src/HexEditorGui.cpp:656:99: error: invalid use of incomplete type 'class wxFont'
    In file included from /usr/include/wx-2.8/wx/bitmap.h:20:0,
    from /usr/include/wx-2.8/wx/artprov.h:16,
    from src/HexEditorGui.h:11,
    from src/HexEditorGui.cpp:18:
    /usr/include/wx-2.8/wx/gdicmn.h:34:28: error: forward declaration of 'class wxFont'
    src/HexEditorGui.cpp:663:2: error: 'm_choiceASMType' was not declared in this scope
    src/HexEditorGui.cpp:663:24: error: expected type-specifier before 'wxChoice'
    src/HexEditorGui.cpp:663:24: error: expected ';' before 'wxChoice'
    src/HexEditorGui.cpp:671:2: error: 'm_choiceBitMode' was not declared in this scope
    src/HexEditorGui.cpp:671:24: error: expected type-specifier before 'wxChoice'
    src/HexEditorGui.cpp:671:24: error: expected ';' before 'wxChoice'
    src/HexEditorGui.cpp:680:2: error: 'm_dasmCtrl' was not declared in this scope
    src/HexEditorGui.cpp:680:19: error: expected type-specifier before 'wxTextCtrl'
    src/HexEditorGui.cpp:680:19: error: expected ';' before 'wxTextCtrl'
    src/HexEditorGui.cpp:685:8: error: 'class DisassemblerPanelGUI' has no member named 'SetSizer'
    src/HexEditorGui.cpp:686:8: error: 'class DisassemblerPanelGUI' has no member named 'Layout'
    src/HexEditorGui.cpp:689:112: error: 'wxCommandEventHandler' was not declared in this scope
    src/HexEditorGui.cpp: In destructor 'virtual DisassemblerPanelGUI::~DisassemblerPanelGUI()':
    src/HexEditorGui.cpp:697:2: error: 'm_choiceVendor' was not declared in this scope
    src/HexEditorGui.cpp:697:115: error: 'wxCommandEventHandler' was not declared in this scope
    src/HexEditorGui.cpp:698:2: error: 'm_choiceASMType' was not declared in this scope
    src/HexEditorGui.cpp:699:2: error: 'm_choiceBitMode' was not declared in this scope
    src/HexEditorGui.cpp: In constructor 'GotoDialogGui::GotoDialogGui(wxWindow
    , wxWindowID, const wxString&, const wxPoint&, const wxSize&, long int)':
    src/HexEditorGui.cpp:703:142: error: class 'GotoDialogGui' does not have any field named 'wxDialog'
    src/HexEditorGui.cpp:705:8: error: 'class GotoDialogGui' has no member named 'SetSizeHints'
    src/HexEditorGui.cpp:713:2: error: 'm_staticTextOffset' was not declared in this scope
    src/HexEditorGui.cpp:713:27: error: expected type-specifier before 'wxStaticText'
    src/HexEditorGui.cpp:713:27: error: expected ';' before 'wxStaticText'
    src/HexEditorGui.cpp:721:2: error: 'm_choiceMode' was not declared in this scope
    src/HexEditorGui.cpp:721:21: error: expected type-specifier before 'wxChoice'
    src/HexEditorGui.cpp:721:21: error: expected ';' before 'wxChoice'
    src/HexEditorGui.cpp:725:2: error: 'm_comboBoxOffset' was not declared in this scope
    src/HexEditorGui.cpp:725:25: error: expected type-specifier before 'wxComboBox'
    src/HexEditorGui.cpp:725:25: error: expected ';' before 'wxComboBox'
    src/HexEditorGui.cpp:738:2: error: 'm_dec' was not declared in this scope
    src/HexEditorGui.cpp:738:14: error: expected type-specifier before 'wxRadioButton'
    src/HexEditorGui.cpp:738:14: error: expected ';' before 'wxRadioButton'
    src/HexEditorGui.cpp:742:2: error: 'm_hex' was not declared in this scope
    src/HexEditorGui.cpp:742:14: error: expected type-specifier before 'wxRadioButton'
    src/HexEditorGui.cpp:742:14: error: expected ';' before 'wxRadioButton'
    src/HexEditorGui.cpp:751:106: error: invalid use of incomplete type 'class wxButton'
    In file included from src/HexEditorGui.h:24:0,
    from src/HexEditorGui.cpp:18:
    /usr/include/wx-2.8/wx/sizer.h:23:28: error: forward declaration of 'class wxButton'
    src/HexEditorGui.cpp:752:15: error: invalid use of incomplete type 'class wxButton'
    In file included from src/HexEditorGui.h:24:0,
    from src/HexEditorGui.cpp:18:
    /usr/include/wx-2.8/wx/sizer.h:23:28: error: forward declaration of 'class wxButton'
    src/HexEditorGui.cpp:754:73: error: invalid conversion from 'wxButton' to 'int' [-fpermissive]
    In file included from src/HexEditorGui.h:24:0,
    from src/HexEditorGui.cpp:18:
    /usr/include/wx-2.8/wx/sizer.h:956:1: error: initializing argument 1 of 'wxSizerItem
    wxSizer::Add(int, int, int, int, int, wxObject)' [-fpermissive]
    src/HexEditorGui.cpp:756:102: error: invalid use of incomplete type 'class wxButton'
    In file included from src/HexEditorGui.h:24:0,
    from src/HexEditorGui.cpp:18:
    /usr/include/wx-2.8/wx/sizer.h:23:28: error: forward declaration of 'class wxButton'
    src/HexEditorGui.cpp:757:15: error: invalid use of incomplete type 'class wxButton'
    In file included from src/HexEditorGui.h:24:0,
    from src/HexEditorGui.cpp:18:
    /usr/include/wx-2.8/wx/sizer.h:23:28: error: forward declaration of 'class wxButton'
    src/HexEditorGui.cpp:759:81: error: invalid conversion from 'wxButton
    ' to 'int' [-fpermissive]
    In file included from src/HexEditorGui.h:24:0,
    from src/HexEditorGui.cpp:18:
    /usr/include/wx-2.8/wx/sizer.h:956:1: error: initializing argument 1 of 'wxSizerItem wxSizer::Add(int, int, int, int, int, wxObject)' [-fpermissive]
    src/HexEditorGui.cpp:769:2: error: 'm_branch' was not declared in this scope
    src/HexEditorGui.cpp:769:17: error: expected type-specifier before 'wxRadioBox'
    src/HexEditorGui.cpp:769:17: error: expected ';' before 'wxRadioBox'
    src/HexEditorGui.cpp:773:92: error: invalid use of incomplete type 'class wxButton'
    In file included from src/HexEditorGui.h:24:0,
    from src/HexEditorGui.cpp:18:
    /usr/include/wx-2.8/wx/sizer.h:23:28: error: forward declaration of 'class wxButton'
    src/HexEditorGui.cpp:774:13: error: invalid use of incomplete type 'class wxButton'
    In file included from src/HexEditorGui.h:24:0,
    from src/HexEditorGui.cpp:18:
    /usr/include/wx-2.8/wx/sizer.h:23:28: error: forward declaration of 'class wxButton'
    src/HexEditorGui.cpp:775:68: error: invalid conversion from 'wxButton' to 'int' [-fpermissive]
    In file included from src/HexEditorGui.h:24:0,
    from src/HexEditorGui.cpp:18:
    /usr/include/wx-2.8/wx/sizer.h:956:1: error: initializing argument 1 of 'wxSizerItem
    wxSizer::Add(int, int, int, int, int, wxObject)' [-fpermissive]
    src/HexEditorGui.cpp:781:8: error: 'class GotoDialogGui' has no member named 'SetSizer'
    src/HexEditorGui.cpp:782:8: error: 'class GotoDialogGui' has no member named 'Layout'
    src/HexEditorGui.cpp:783:23: error: no matching function for call to 'wxBoxSizer::Fit(GotoDialogGui
    const)'
    src/HexEditorGui.cpp:783:23: note: candidate is:
    In file included from src/HexEditorGui.h:24:0,
    from src/HexEditorGui.cpp:18:
    /usr/include/wx-2.8/wx/sizer.h:570:12: note: wxSize wxSizer::Fit(wxWindow)
    /usr/include/wx-2.8/wx/sizer.h:570:12: note: no known conversion for argument 1 from 'GotoDialogGui
    const' to 'wxWindow'
    src/HexEditorGui.cpp:786:107: error: 'wxCommandEventHandler' was not declared in this scope
    src/HexEditorGui.cpp:787:82: error: 'wxKeyEventHandler' was not declared in this scope
    src/HexEditorGui.cpp:789:29: error: 'wxEVT_COMMAND_TEXT_ENTER' was not declared in this scope
    src/HexEditorGui.cpp:792:15: error: invalid use of incomplete type 'class wxButton'
    In file included from src/HexEditorGui.h:24:0,
    from src/HexEditorGui.cpp:18:
    /usr/include/wx-2.8/wx/sizer.h:23:28: error: forward declaration of 'class wxButton'
    src/HexEditorGui.cpp:793:15: error: invalid use of incomplete type 'class wxButton'
    In file included from src/HexEditorGui.h:24:0,
    from src/HexEditorGui.cpp:18:
    /usr/include/wx-2.8/wx/sizer.h:23:28: error: forward declaration of 'class wxButton'
    src/HexEditorGui.cpp:795:13: error: invalid use of incomplete type 'class wxButton'
    In file included from src/HexEditorGui.h:24:0,
    from src/HexEditorGui.cpp:18:
    /usr/include/wx-2.8/wx/sizer.h:23:28: error: forward declaration of 'class wxButton'
    src/HexEditorGui.cpp: In destructor 'GotoDialogGui::~GotoDialogGui()':
    src/HexEditorGui.cpp:801:2: error: 'm_choiceMode' was not declared in this scope
    src/HexEditorGui.cpp:801:110: error: 'wxCommandEventHandler' was not declared in this scope
    src/HexEditorGui.cpp:802:2: error: 'm_comboBoxOffset' was not declared in this scope
    src/HexEditorGui.cpp:802:85: error: 'wxKeyEventHandler' was not declared in this scope
    src/HexEditorGui.cpp:804:32: error: 'wxEVT_COMMAND_TEXT_ENTER' was not declared in this scope
    src/HexEditorGui.cpp:805:2: error: 'm_dec' was not declared in this scope
    src/HexEditorGui.cpp:806:2: error: 'm_hex' was not declared in this scope
    src/HexEditorGui.cpp:807:15: error: invalid use of incomplete type 'class wxButton'
    In file included from src/HexEditorGui.h:24:0,
    from src/HexEditorGui.cpp:18:
    /usr/include/wx-2.8/wx/sizer.h:23:28: error: forward declaration of 'class wxButton'
    src/HexEditorGui.cpp:808:15: error: invalid use of incomplete type 'class wxButton'
    In file included from src/HexEditorGui.h:24:0,
    from src/HexEditorGui.cpp:18:
    /usr/include/wx-2.8/wx/sizer.h:23:28: error: forward declaration of 'class wxButton'
    src/HexEditorGui.cpp:809:2: error: 'm_branch' was not declared in this scope
    src/HexEditorGui.cpp:810:13: error: invalid use of incomplete type 'class wxButton'
    In file included from src/HexEditorGui.h:24:0,
    from src/HexEditorGui.cpp:18:
    /usr/include/wx-2.8/wx/sizer.h:23:28: error: forward declaration of 'class wxButton'
    src/HexEditorGui.cpp: In constructor 'FindDialogGui::FindDialogGui(wxWindow
    , wxWindowID, const wxString&, const wxPoint&, const wxSize&, long int)':
    src/HexEditorGui.cpp:814:142: error: class 'FindDialogGui' does not have any field named 'wxDialog'
    src/HexEditorGui.cpp:816:8: error: 'class FindDialogGui' has no member named 'SetSizeHints'
    src/HexEditorGui.cpp:836:2: error: 'm_static_search' was not declared in this scope
    src/HexEditorGui.cpp:836:24: error: expected type-specifier before 'wxStaticText'
    src/HexEditorGui.cpp:836:24: error: expected ';' before 'wxStaticText'
    src/HexEditorGui.cpp:840:2: error: 'm_comboBoxSearch' was not declared in this scope
    src/HexEditorGui.cpp:840:25: error: expected type-specifier before 'wxComboBox'
    src/HexEditorGui.cpp:840:25: error: expected ';' before 'wxComboBox'
    src/HexEditorGui.cpp:853:2: error: 'm_static_replace' was not declared in this scope
    src/HexEditorGui.cpp:853:25: error: expected type-specifier before 'wxStaticText'
    src/HexEditorGui.cpp:853:25: error: expected ';' before 'wxStaticText'
    src/HexEditorGui.cpp:859:2: error: 'm_comboBoxReplace' was not declared in this scope
    src/HexEditorGui.cpp:859:26: error: expected type-specifier before 'wxComboBox'
    src/HexEditorGui.cpp:859:26: error: expected ';' before 'wxComboBox'
    src/HexEditorGui.cpp:885:2: error: 'm_searchtype' was not declared in this scope
    src/HexEditorGui.cpp:885:21: error: expected type-specifier before 'wxRadioBox'
    src/HexEditorGui.cpp:885:21: error: expected ';' before 'wxRadioBox'
    src/HexEditorGui.cpp:889:2: error: 'wxStaticBoxSizer' was not declared in this scope
    src/HexEditorGui.cpp:889:20: error: 'sbSizerSearchOptions' was not declared in this scope
    src/HexEditorGui.cpp:890:29: error: expected type-specifier before 'wxStaticBoxSizer'
    src/HexEditorGui.cpp:890:29: error: expected ';' before 'wxStaticBoxSizer'
    src/HexEditorGui.cpp:892:2: error: 'chkMatchCase' was not declared in this scope
    src/HexEditorGui.cpp:892:21: error: expected type-specifier before 'wxCheckBox'
    src/HexEditorGui.cpp:892:21: error: expected ';' before 'wxCheckBox'
    src/HexEditorGui.cpp:895:2: error: 'chkSearchBackwards' was not declared in this scope
    src/HexEditorGui.cpp:895:27: error: expected type-specifier before 'wxCheckBox'
    src/HexEditorGui.cpp:895:27: error: expected ';' before 'wxCheckBox'
    src/HexEditorGui.cpp:898:2: error: 'chkWrapAround' was not declared in this scope
    src/HexEditorGui.cpp:898:22: error: expected type-specifier before 'wxCheckBox'
    src/HexEditorGui.cpp:898:22: error: expected ';' before 'wxCheckBox'
    src/HexEditorGui.cpp:901:2: error: 'chkUTF8' was not declared in this scope
    src/HexEditorGui.cpp:901:16: error: expected type-specifier before 'wxCheckBox'
    src/HexEditorGui.cpp:901:16: error: expected ';' before 'wxCheckBox'
    src/HexEditorGui.cpp:916:89: error: invalid use of incomplete type 'class wxButton'
    In file included from src/HexEditorGui.h:24:0,
    from src/HexEditorGui.cpp:18:
    /usr/include/wx-2.8/wx/sizer.h:23:28: error: forward declaration of 'class wxButton'
    src/HexEditorGui.cpp:917:9: error: invalid use of incomplete type 'class wxButton'
    In file included from src/HexEditorGui.h:24:0,
    from src/HexEditorGui.cpp:18:
    /usr/include/wx-2.8/wx/sizer.h:23:28: error: forward declaration of 'class wxButton'
    src/HexEditorGui.cpp:918:67: error: invalid conversion from 'wxButton' to 'int' [-fpermissive]
    In file included from src/HexEditorGui.h:24:0,
    from src/HexEditorGui.cpp:18:
    /usr/include/wx-2.8/wx/sizer.h:956:1: error: initializing argument 1 of 'wxSizerItem
    wxSizer::Add(int, int, int, int, int, wxObject)' [-fpermissive]
    src/HexEditorGui.cpp:920:96: error: invalid use of incomplete type 'class wxButton'
    In file included from src/HexEditorGui.h:24:0,
    from src/HexEditorGui.cpp:18:
    /usr/include/wx-2.8/wx/sizer.h:23:28: error: forward declaration of 'class wxButton'
    src/HexEditorGui.cpp:921:70: error: invalid conversion from 'wxButton
    ' to 'int' [-fpermissive]
    In file included from src/HexEditorGui.h:24:0,
    from src/HexEditorGui.cpp:18:
    /usr/include/wx-2.8/wx/sizer.h:956:1: error: initializing argument 1 of 'wxSizerItem wxSizer::Add(int, int, int, int, int, wxObject)' [-fpermissive]
    src/HexEditorGui.cpp:923:109: error: invalid use of incomplete type 'class wxButton'
    In file included from src/HexEditorGui.h:24:0,
    from src/HexEditorGui.cpp:18:
    /usr/include/wx-2.8/wx/sizer.h:23:28: error: forward declaration of 'class wxButton'
    src/HexEditorGui.cpp:924:18: error: invalid use of incomplete type 'class wxButton'
    In file included from src/HexEditorGui.h:24:0,
    from src/HexEditorGui.cpp:18:
    /usr/include/wx-2.8/wx/sizer.h:23:28: error: forward declaration of 'class wxButton'
    src/HexEditorGui.cpp:926:87: error: invalid conversion from 'wxButton' to 'int' [-fpermissive]
    In file included from src/HexEditorGui.h:24:0,
    from src/HexEditorGui.cpp:18:
    /usr/include/wx-2.8/wx/sizer.h:956:1: error: initializing argument 1 of 'wxSizerItem
    wxSizer::Add(int, int, int, int, int, wxObject)' [-fpermissive]
    src/HexEditorGui.cpp:928:2: error: 'm_staticline' was not declared in this scope
    src/HexEditorGui.cpp:928:21: error: expected type-specifier before 'wxStaticLine'
    src/HexEditorGui.cpp:928:21: error: expected ';' before 'wxStaticLine'
    src/HexEditorGui.cpp:933:95: error: invalid use of incomplete type 'class wxButton'
    In file included from src/HexEditorGui.h:24:0,
    from src/HexEditorGui.cpp:18:
    /usr/include/wx-2.8/wx/sizer.h:23:28: error: forward declaration of 'class wxButton'
    src/HexEditorGui.cpp:934:12: error: invalid use of incomplete type 'class wxButton'
    In file included from src/HexEditorGui.h:24:0,
    from src/HexEditorGui.cpp:18:
    /usr/include/wx-2.8/wx/sizer.h:23:28: error: forward declaration of 'class wxButton'
    src/HexEditorGui.cpp:936:81: error: invalid conversion from 'wxButton
    ' to 'int' [-fpermissive]
    In file included from src/HexEditorGui.h:24:0,
    from src/HexEditorGui.cpp:18:
    /usr/include/wx-2.8/wx/sizer.h:956:1: error: initializing argument 1 of 'wxSizerItem wxSizer::Add(int, int, int, int, int, wxObject)' [-fpermissive]
    src/HexEditorGui.cpp:938:102: error: invalid use of incomplete type 'class wxButton'
    In file included from src/HexEditorGui.h:24:0,
    from src/HexEditorGui.cpp:18:
    /usr/include/wx-2.8/wx/sizer.h:23:28: error: forward declaration of 'class wxButton'
    src/HexEditorGui.cpp:939:15: error: invalid use of incomplete type 'class wxButton'
    In file included from src/HexEditorGui.h:24:0,
    from src/HexEditorGui.cpp:18:
    /usr/include/wx-2.8/wx/sizer.h:23:28: error: forward declaration of 'class wxButton'
    src/HexEditorGui.cpp:941:84: error: invalid conversion from 'wxButton' to 'int' [-fpermissive]
    In file included from src/HexEditorGui.h:24:0,
    from src/HexEditorGui.cpp:18:
    /usr/include/wx-2.8/wx/sizer.h:956:1: error: initializing argument 1 of 'wxSizerItem
    wxSizer::Add(int, int, int, int, int, wxObject)' [-fpermissive]
    src/HexEditorGui.cpp:943:95: error: invalid use of incomplete type 'class wxButton'
    In file included from src/HexEditorGui.h:24:0,
    from src/HexEditorGui.cpp:18:
    /usr/include/wx-2.8/wx/sizer.h:23:28: error: forward declaration of 'class wxButton'
    src/HexEditorGui.cpp:944:79: error: invalid conversion from 'wxButton
    ' to 'int' [-fpermissive]
    In file included from src/HexEditorGui.h:24:0,
    from src/HexEditorGui.cpp:18:
    /usr/include/wx-2.8/wx/sizer.h:956:1: error: initializing argument 1 of 'wxSizerItem wxSizer::Add(int, int, int, int, int, wxObject)' [-fpermissive]
    src/HexEditorGui.cpp:950:8: error: 'class FindDialogGui' has no member named 'SetSizer'
    src/HexEditorGui.cpp:951:8: error: 'class FindDialogGui' has no member named 'Layout'
    src/HexEditorGui.cpp:952:24: error: no matching function for call to 'wxBoxSizer::Fit(FindDialogGui const)'
    src/HexEditorGui.cpp:952:24: note: candidate is:
    In file included from src/HexEditorGui.h:24:0,
    from src/HexEditorGui.cpp:18:
    /usr/include/wx-2.8/wx/sizer.h:570:12: note: wxSize wxSizer::Fit(wxWindow
    )
    /usr/include/wx-2.8/wx/sizer.h:570:12: note: no known conversion for argument 1 from 'FindDialogGui const' to 'wxWindow'
    src/HexEditorGui.cpp:954:8: error: 'class FindDialogGui' has no member named 'Centre'
    src/HexEditorGui.cpp:957:82: error: 'wxKeyEventHandler' was not declared in this scope
    src/HexEditorGui.cpp:958:108: error: 'wxCommandEventHandler' was not declared in this scope
    src/HexEditorGui.cpp:959:29: error: 'wxEVT_COMMAND_TEXT_ENTER' was not declared in this scope
    src/HexEditorGui.cpp:968:9: error: invalid use of incomplete type 'class wxButton'
    In file included from src/HexEditorGui.h:24:0,
    from src/HexEditorGui.cpp:18:
    /usr/include/wx-2.8/wx/sizer.h:23:28: error: forward declaration of 'class wxButton'
    src/HexEditorGui.cpp:969:12: error: invalid use of incomplete type 'class wxButton'
    In file included from src/HexEditorGui.h:24:0,
    from src/HexEditorGui.cpp:18:
    /usr/include/wx-2.8/wx/sizer.h:23:28: error: forward declaration of 'class wxButton'
    src/HexEditorGui.cpp:970:18: error: invalid use of incomplete type 'class wxButton'
    In file included from src/HexEditorGui.h:24:0,
    from src/HexEditorGui.cpp:18:
    /usr/include/wx-2.8/wx/sizer.h:23:28: error: forward declaration of 'class wxButton'
    src/HexEditorGui.cpp:971:12: error: invalid use of incomplete type 'class wxButton'
    In file included from src/HexEditorGui.h:24:0,
    from src/HexEditorGui.cpp:18:
    /usr/include/wx-2.8/wx/sizer.h:23:28: error: forward declaration of 'class wxButton'
    src/HexEditorGui.cpp:972:15: error: invalid use of incomplete type 'class wxButton'
    In file included from src/HexEditorGui.h:24:0,
    from src/HexEditorGui.cpp:18:
    /usr/include/wx-2.8/wx/sizer.h:23:28: error: forward declaration of 'class wxButton'
    src/HexEditorGui.cpp: In destructor 'FindDialogGui::~FindDialogGui()':
    src/HexEditorGui.cpp:978:2: error: 'm_comboBoxSearch' was not declared in this scope
    src/HexEditorGui.cpp:978:85: error: 'wxKeyEventHandler' was not declared in this scope
    src/HexEditorGui.cpp:979:111: error: 'wxCommandEventHandler' was not declared in this scope
    src/HexEditorGui.cpp:980:32: error: 'wxEVT_COMMAND_TEXT_ENTER' was not declared in this scope
    src/HexEditorGui.cpp:981:2: error: 'm_comboBoxReplace' was not declared in this scope
    src/HexEditorGui.cpp:984:2: error: 'm_searchtype' was not declared in this scope
    src/HexEditorGui.cpp:985:2: error: 'chkMatchCase' was not declared in this scope
    src/HexEditorGui.cpp:986:2: error: 'chkSearchBackwards' was not declared in this scope
    src/HexEditorGui.cpp:987:2: error: 'chkWrapAround' was not declared in this scope
    src/HexEditorGui.cpp:988:2: error: 'chkUTF8' was not declared in this scope
    src/HexEditorGui.cpp:989:9: error: invalid use of incomplete type 'class wxButton'
    In file included from src/HexEditorGui.h:24:0,
    from src/HexEditorGui.cpp:18:
    /usr/include/wx-2.8/wx/sizer.h:23:28: error: forward declaration of 'class wxButton'
    src/HexEditorGui.cpp:990:12: error: invalid use of incomplete type 'class wxButton'
    In file included from src/HexEditorGui.h:24:0,
    from src/HexEditorGui.cpp:18:
    /usr/include/wx-2.8/wx/sizer.h:23:28: error: forward declaration of 'class wxButton'
    src/HexEditorGui.cpp:991:18: error: invalid use of incomplete type 'class wxButton'
    In file included from src/HexEditorGui.h:24:0,
    from src/HexEditorGui.cpp:18:
    /usr/include/wx-2.8/wx/sizer.h:23:28: error: forward declaration of 'class wxButton'
    src/HexEditorGui.cpp:992:12: error: invalid use of incomplete type 'class wxButton'
    In file included from src/HexEditorGui.h:24:0,
    from src/HexEditorGui.cpp:18:
    /usr/include/wx-2.8/wx/sizer.h:23:28: error: forward declaration of 'class wxButton'
    src/HexEditorGui.cpp:993:15: error: invalid use of incomplete type 'class wxButton'
    In file included from src/HexEditorGui.h:24:0,
    from src/HexEditorGui.cpp:18:
    /usr/include/wx-2.8/wx/sizer.h:23:28: error: forward declaration of 'class wxButton'
    src/HexEditorGui.cpp: In constructor 'UpdateDialogGui::UpdateDialogGui(wxWindow, wxWindowID, const wxString&, const wxPoint&, const wxSize&, long int)':
    src/HexEditorGui.cpp:997:146: error: class 'UpdateDialogGui' does not have any field named 'wxDialog'
    src/HexEditorGui.cpp:999:8: error: 'class UpdateDialogGui' has no member named 'SetSizeHints'
    src/HexEditorGui.cpp:1004:2: error: 'wxbtmp_icon' was not declared in this scope
    src/HexEditorGui.cpp:1004:20: error: expected type-specifier before 'wxStaticBitmap'
    src/HexEditorGui.cpp:1004:20: error: expected ';' before 'wxStaticBitmap'
    src/HexEditorGui.cpp:1010:2: error: 'version_text' was not declared in this scope
    src/HexEditorGui.cpp:1010:21: error: expected type-specifier before 'wxStaticText'
    src/HexEditorGui.cpp:1010:21: error: expected ';' before 'wxStaticText'
    src/HexEditorGui.cpp:1014:2: error: 'm_hyperlink' was not declared in this scope
    src/HexEditorGui.cpp:1014:20: error: expected type-specifier before 'wxHyperlinkCtrl'
    src/HexEditorGui.cpp:1014:20: error: expected ';' before 'wxHyperlinkCtrl'
    src/HexEditorGui.cpp:1017:2: error: 'wxchk_display' was not declared in this scope
    src/HexEditorGui.cpp:1017:22: error: expected type-specifier before 'wxCheckBox'
    src/HexEditorGui.cpp:1017:22: error: expected ';' before 'wxCheckBox'
    src/HexEditorGui.cpp:1024:8: error: 'class UpdateDialogGui' has no member named 'SetSizer'
    src/HexEditorGui.cpp:1025:8: error: 'class UpdateDialogGui' has no member named 'Layout'
    src/HexEditorGui.cpp:1026:26: error: no matching function for call to 'wxBoxSizer::Fit(UpdateDialogGui
    const)'
    src/HexEditorGui.cpp:1026:26: note: candidate is:
    In file included from src/HexEditorGui.h:24:0,
    from src/HexEditorGui.cpp:18:
    /usr/include/wx-2.8/wx/sizer.h:570:12: note: wxSize wxSizer::Fit(wxWindow)
    /usr/include/wx-2.8/wx/sizer.h:570:12: note: no known conversion for argument 1 from 'UpdateDialogGui
    const' to 'wxWindow'
    src/HexEditorGui.cpp:1029:111: error: 'wxCommandEventHandler' was not declared in this scope
    src/HexEditorGui.cpp: In destructor 'UpdateDialogGui::~UpdateDialogGui()':
    src/HexEditorGui.cpp:1035:2: error: 'wxchk_display' was not declared in this scope
    src/HexEditorGui.cpp:1035:114: error: 'wxCommandEventHandler' was not declared in this scope
    src/HexEditorGui.cpp: In constructor 'CompareDialogGui::CompareDialogGui(wxWindow
    , wxWindowID, const wxString&, const wxPoint&, const wxSize&, long int)':
    src/HexEditorGui.cpp:1039:148: error: class 'CompareDialogGui' does not have any field named 'wxDialog'
    src/HexEditorGui.cpp:1041:8: error: 'class CompareDialogGui' has no member named 'SetSizeHints'
    src/HexEditorGui.cpp:1052:2: error: 'm_TextFile1' was not declared in this scope
    src/HexEditorGui.cpp:1052:20: error: expected type-specifier before 'wxStaticText'
    src/HexEditorGui.cpp:1052:20: error: expected ';' before 'wxStaticText'
    src/HexEditorGui.cpp:1056:2: error: 'filePick1' was not declared in this scope
    src/HexEditorGui.cpp:1056:18: error: expected type-specifier before 'wxFilePickerCtrl'
    src/HexEditorGui.cpp:1056:18: error: expected ';' before 'wxFilePickerCtrl'
    src/HexEditorGui.cpp:1059:2: error: 'm_TextFile2' was not declared in this scope
    src/HexEditorGui.cpp:1059:20: error: expected type-specifier before 'wxStaticText'
    src/HexEditorGui.cpp:1059:20: error: expected ';' before 'wxStaticText'
    src/HexEditorGui.cpp:1063:2: error: 'filePick2' was not declared in this scope
    src/HexEditorGui.cpp:1063:18: error: expected type-specifier before 'wxFilePickerCtrl'
    src/HexEditorGui.cpp:1063:18: error: expected ';' before 'wxFilePickerCtrl'
    src/HexEditorGui.cpp:1069:2: error: 'wxStaticBoxSizer' was not declared in this scope
    src/HexEditorGui.cpp:1069:20: error: 'sbSizerSearchFor' was not declared in this scope
    src/HexEditorGui.cpp:1070:25: error: expected type-specifier before 'wxStaticBoxSizer'
    src/HexEditorGui.cpp:1070:25: error: expected ';' before 'wxStaticBoxSizer'
    src/HexEditorGui.cpp:1072:2: error: 'm_radioDifferent' was not declared in this scope
    src/HexEditorGui.cpp:1072:25: error: expected type-specifier before 'wxRadioButton'
    src/HexEditorGui.cpp:1072:25: error: expected ';' before 'wxRadioButton'
    src/HexEditorGui.cpp:1076:2: error: 'm_radioSame' was not declared in this scope
    src/HexEditorGui.cpp:1076:20: error: expected type-specifier before 'wxRadioButton'
    src/HexEditorGui.cpp:1076:20: error: expected ';' before 'wxRadioButton'
    src/HexEditorGui.cpp:1085:2: error: 'checkStopCompare' was not declared in this scope
    src/HexEditorGui.cpp:1085:25: error: expected type-specifier before 'wxCheckBox'
    src/HexEditorGui.cpp:1085:25: error: expected ';' before 'wxCheckBox'
    src/HexEditorGui.cpp:1088:2: error: 'spinStopCompare' was not declared in this scope
    src/HexEditorGui.cpp:1088:24: error: expected type-specifier before 'wxSpinCtrl'
    src/HexEditorGui.cpp:1088:24: error: expected ';' before 'wxSpinCtrl'
    src/HexEditorGui.cpp:1093:2: error: 'm_staticTextHits' was not declared in this scope
    src/HexEditorGui.cpp:1093:25: error: expected type-specifier before 'wxStaticText'
    src/HexEditorGui.cpp:1093:25: error: expected ';' before 'wxStaticText'
    src/HexEditorGui.cpp:1103:2: error: 'checkMergeSection' was not declared in this scope
    src/HexEditorGui.cpp:1103:26: error: expected type-specifier before 'wxCheckBox'
    src/HexEditorGui.cpp:1103:26: error: expected ';' before 'wxCheckBox'
    src/HexEditorGui.cpp:1106:2: error: 'spinMergeSection' was not declared in this scope
    src/HexEditorGui.cpp:1106:25: error: expected type-specifier before 'wxSpinCtrl'
    src/HexEditorGui.cpp:1106:25: error: expected ';' before 'wxSpinCtrl'
    src/HexEditorGui.cpp:1111:2: error: 'm_staticTextBytes' was not declared in this scope
    src/HexEditorGui.cpp:1111:26: error: expected type-specifier before 'wxStaticText'
    src/HexEditorGui.cpp:1111:26: error: expected ';' before 'wxStaticText'
    src/HexEditorGui.cpp:1121:2: error: 'checkSaveResults' was not declared in this scope
    src/HexEditorGui.cpp:1121:25: error: expected type-specifier before 'wxCheckBox'
    src/HexEditorGui.cpp:1121:25: error: expected ';' before 'wxCheckBox'
    src/HexEditorGui.cpp:1124:2: error: 'filePickSave' was not declared in this scope
    src/HexEditorGui.cpp:1124:21: error: expected type-specifier before 'wxFilePickerCtrl'
    src/HexEditorGui.cpp:1124:21: error: expected ';' before 'wxFilePickerCtrl'
    src/HexEditorGui.cpp:1135:96: error: invalid use of incomplete type 'class wxButton'
    In file included from src/HexEditorGui.h:24:0,
    from src/HexEditorGui.cpp:18:
    /usr/include/wx-2.8/wx/sizer.h:23:28: error: forward declaration of 'class wxButton'
    src/HexEditorGui.cpp:1136:69: error: invalid conversion from 'wxButton' to 'int' [-fpermissive]
    In file included from src/HexEditorGui.h:24:0,
    from src/HexEditorGui.cpp:18:
    /usr/include/wx-2.8/wx/sizer.h:956:1: error: initializing argument 1 of 'wxSizerItem
    wxSizer::Add(int, int, int, int, int, wxObject)' [-fpermissive]
    src/HexEditorGui.cpp:1138:95: error: invalid use of incomplete type 'class wxButton'
    In file included from src/HexEditorGui.h:24:0,
    from src/HexEditorGui.cpp:18:
    /usr/include/wx-2.8/wx/sizer.h:23:28: error: forward declaration of 'class wxButton'
    src/HexEditorGui.cpp:1139:12: error: invalid use of incomplete type 'class wxButton'
    In file included from src/HexEditorGui.h:24:0,
    from src/HexEditorGui.cpp:18:
    /usr/include/wx-2.8/wx/sizer.h:23:28: error: forward declaration of 'class wxButton'
    src/HexEditorGui.cpp:1140:12: error: invalid use of incomplete type 'class wxButton'
    In file included from src/HexEditorGui.h:24:0,
    from src/HexEditorGui.cpp:18:
    /usr/include/wx-2.8/wx/sizer.h:23:28: error: forward declaration of 'class wxButton'
    src/HexEditorGui.cpp:1142:70: error: invalid conversion from 'wxButton
    ' to 'int' [-fpermissive]
    In file included from src/HexEditorGui.h:24:0,
    from src/HexEditorGui.cpp:18:
    /usr/include/wx-2.8/wx/sizer.h:956:1: error: initializing argument 1 of 'wxSizerItem wxSizer::Add(int, int, int, int, int, wxObject)' [-fpermissive]
    src/HexEditorGui.cpp:1148:8: error: 'class CompareDialogGui' has no member named 'SetSizer'
    src/HexEditorGui.cpp:1149:8: error: 'class CompareDialogGui' has no member named 'Layout'
    src/HexEditorGui.cpp:1150:24: error: no matching function for call to 'wxBoxSizer::Fit(CompareDialogGui const)'
    src/HexEditorGui.cpp:1150:24: note: candidate is:
    In file included from src/HexEditorGui.h:24:0,
    from src/HexEditorGui.cpp:18:
    /usr/include/wx-2.8/wx/sizer.h:570:12: note: wxSize wxSizer::Fit(wxWindow
    )
    /usr/include/wx-2.8/wx/sizer.h:570:12: note: no known conversion for argument 1 from 'CompareDialogGui const' to 'wxWindow'
    src/HexEditorGui.cpp:1152:8: error: 'class CompareDialogGui' has no member named 'Centre'
    src/HexEditorGui.cpp:1155:22: error: 'wxEVT_COMMAND_FILEPICKER_CHANGED' was not declared in this scope
    src/HexEditorGui.cpp:1155:116: error: 'wxFileDirPickerEventHandler' was not declared in this scope
    src/HexEditorGui.cpp:1157:119: error: 'wxCommandEventHandler' was not declared in this scope
    src/HexEditorGui.cpp:1163:11: error: invalid use of incomplete type 'class wxButton'
    In file included from src/HexEditorGui.h:24:0,
    from src/HexEditorGui.cpp:18:
    /usr/include/wx-2.8/wx/sizer.h:23:28: error: forward declaration of 'class wxButton'
    src/HexEditorGui.cpp:1164:12: error: invalid use of incomplete type 'class wxButton'
    In file included from src/HexEditorGui.h:24:0,
    from src/HexEditorGui.cpp:18:
    /usr/include/wx-2.8/wx/sizer.h:23:28: error: forward declaration of 'class wxButton'
    src/HexEditorGui.cpp: In destructor 'CompareDialogGui::~CompareDialogGui()':
    src/HexEditorGui.cpp:1170:2: error: 'filePick1' was not declared in this scope
    src/HexEditorGui.cpp:1170:25: error: 'wxEVT_COMMAND_FILEPICKER_CHANGED' was not declared in this scope
    src/HexEditorGui.cpp:1170:119: error: 'wxFileDirPickerEventHandler' was not declared in this scope
    src/HexEditorGui.cpp:1171:2: error: 'filePick2' was not declared in this scope
    src/HexEditorGui.cpp:1172:2: error: 'm_radioDifferent' was not declared in this scope
    src/HexEditorGui.cpp:1172:122: error: 'wxCommandEventHandler' was not declared in this scope
    src/HexEditorGui.cpp:1173:2: error: 'm_radioSame' was not declared in this scope
    src/HexEditorGui.cpp:1174:2: error: 'checkStopCompare' was not declared in this scope
    src/HexEditorGui.cpp:1175:2: error: 'checkMergeSection' was not declared in this scope
    src/HexEditorGui.cpp:1176:2: error: 'checkSaveResults' was not declared in this scope
    src/HexEditorGui.cpp:1177:2: error: 'filePickSave' was not declared in this scope
    src/HexEditorGui.cpp:1178:11: error: invalid use of incomplete type 'class wxButton'
    In file included from src/HexEditorGui.h:24:0,
    from src/HexEditorGui.cpp:18:
    /usr/include/wx-2.8/wx/sizer.h:23:28: error: forward declaration of 'class wxButton'
    src/HexEditorGui.cpp:1179:12: error: invalid use of incomplete type 'class wxButton'
    In file included from src/HexEditorGui.h:24:0,
    from src/HexEditorGui.cpp:18:
    /usr/include/wx-2.8/wx/sizer.h:23:28: error: forward declaration of 'class wxButton'
    src/HexEditorGui.cpp: In constructor 'ChecksumDialogGui::ChecksumDialogGui(wxWindow, wxWindowID, const wxString&, const wxPoint&, const wxSize&, long int)':
    src/HexEditorGui.cpp:1183:150: error: class 'ChecksumDialogGui' does not have any field named 'wxDialog'
    src/HexEditorGui.cpp:1185:8: error: 'class ChecksumDialogGui' has no member named 'SetSizeHints'
    src/HexEditorGui.cpp:1193:2: error: 'txtFileToHash' was not declared in this scope
    src/HexEditorGui.cpp:1193:22: error: expected type-specifier before 'wxStaticText'
    src/HexEditorGui.cpp:1193:22: error: expected ';' before 'wxStaticText'
    src/HexEditorGui.cpp:1200:2: error: 'chkFile' was not declared in this scope
    src/HexEditorGui.cpp:1200:16: error: expected type-specifier before 'wxCheckBox'
    src/HexEditorGui.cpp:1200:16: error: expected ';' before 'wxCheckBox'
    src/HexEditorGui.cpp:1205:2: error: 'filePick' was not declared in this scope
    src/HexEditorGui.cpp:1205:17: error: expected type-specifier before 'wxFilePickerCtrl'
    src/HexEditorGui.cpp:1205:17: error: expected ';' before 'wxFilePickerCtrl'
    src/HexEditorGui.cpp:1217:2: error: 'wxStaticBoxSizer' was not declared in this scope
    src/HexEditorGui.cpp:1217:20: error: 'sbSizerMD' was not declared in this scope
    src/HexEditorGui.cpp:1218:18: error: expected type-specifier before 'wxStaticBoxSizer'
    src/HexEditorGui.cpp:1218:18: error: expected ';' before 'wxStaticBoxSizer'
    src/HexEditorGui.cpp:1220:2: error: 'chkMD2' was not declared in this scope
    src/HexEditorGui.cpp:1220:15: error: expected type-specifier before 'wxCheckBox'
    src/HexEditorGui.cpp:1220:15: error: expected ';' before 'wxCheckBox'
    src/HexEditorGui.cpp:1223:2: error: 'chkMD4' was not declared in this scope
    src/HexEditorGui.cpp:1223:15: error: expected type-specifier before 'wxCheckBox'
    src/HexEditorGui.cpp:1223:15: error: expected ';' before 'wxCheckBox'
    src/HexEditorGui.cpp:1226:2: error: 'chkMD5' was not declared in this scope
    src/HexEditorGui.cpp:1226:15: error: expected type-specifier before 'wxCheckBox'
    src/HexEditorGui.cpp:1226:15: error: expected ';' before 'wxCheckBox'
    src/HexEditorGui.cpp:1232:20: error: 'sbSizerSHA' was not declared in this scope
    src/HexEditorGui.cpp:1233:19: error: expected type-specifier before 'wxStaticBoxSizer'
    src/HexEditorGui.cpp:1233:19: error: expected ';' before 'wxStaticBoxSizer'
    src/HexEditorGui.cpp:1235:2: error: 'chkSHA1' was not declared in this scope
    src/HexEditorGui.cpp:1235:16: error: expected type-specifier before 'wxCheckBox'
    src/HexEditorGui.cpp:1235:16: error: expected ';' before 'wxCheckBox'
    src/HexEditorGui.cpp:1238:2: error: 'chkSHA224' was not declared in this scope
    src/HexEditorGui.cpp:1238:18: error: expected type-specifier before 'wxCheckBox'
    src/HexEditorGui.cpp:1238:18: error: expected ';' before 'wxCheckBox'
    src/HexEditorGui.cpp:1241:2: error: 'chkSHA256' was not declared in this scope
    src/HexEditorGui.cpp:1241:18: error: expected type-specifier before 'wxCheckBox'
    src/HexEditorGui.cpp:1241:18: error: expected ';' before 'wxCheckBox'
    src/HexEditorGui.cpp:1244:2: error: 'chkSHA384' was not declared in this scope
    src/HexEditorGui.cpp:1244:18: error: expected type-specifier before 'wxCheckBox'
    src/HexEditorGui.cpp:1244:18: error: expected ';' before 'wxCheckBox'
    src/HexEditorGui.cpp:1247:2: error: 'chkSHA512' was not declared in this scope
    src/HexEditorGui.cpp:1247:18: error: expected type-specifier before 'wxCheckBox'
    src/HexEditorGui.cpp:1247:18: error: expected ';' before 'wxCheckBox'
    src/HexEditorGui.cpp:1253:20: error: 'sbSizerRIPEMD' was not declared in this scope
    src/HexEditorGui.cpp:1254:22: error: expected type-specifier before 'wxStaticBoxSizer'
    src/HexEditorGui.cpp:1254:22: error: expected ';' before 'wxStaticBoxSizer'
    src/HexEditorGui.cpp:1256:2: error: 'chkRIPEMD128' was not declared in this scope
    src/HexEditorGui.cpp:1256:21: error: expected type-specifier before 'wxCheckBox'
    src/HexEditorGui.cpp:1256:21: error: expected ';' before 'wxCheckBox'
    src/HexEditorGui.cpp:1259:2: error: 'chkRIPEMD160' was not declared in this scope
    src/HexEditorGui.cpp:1259:21: error: expected type-specifier before 'wxCheckBox'
    src/HexEditorGui.cpp:1259:21: error: expected ';' before 'wxCheckBox'
    src/HexEditorGui.cpp:1262:2: error: 'chkRIPEMD256' was not declared in this scope
    src/HexEditorGui.cpp:1262:21: error: expected type-specifier before 'wxCheckBox'
    src/HexEditorGui.cpp:1262:21: error: expected ';' before 'wxCheckBox'
    src/HexEditorGui.cpp:1265:2: error: 'chkRIPEMD320' was not declared in this scope
    src/HexEditorGui.cpp:1265:21: error: expected type-specifier before 'wxCheckBox'
    src/HexEditorGui.cpp:1265:21: error: expected ';' before 'wxCheckBox'
    src/HexEditorGui.cpp:1271:20: error: 'sbSizerHAVAL' was not declared in this scope
    src/HexEditorGui.cpp:1272:21: error: expected type-specifier before 'wxStaticBoxSizer'
    src/HexEditorGui.cpp:1272:21: error: expected ';' before 'wxStaticBoxSizer'
    src/HexEditorGui.cpp:1274:2: error: 'chkHAVAL128' was not declared in this scope
    src/HexEditorGui.cpp:1274:20: error: expected type-specifier before 'wxCheckBox'
    src/HexEditorGui.cpp:1274:20: error: expected ';' before 'wxCheckBox'
    src/HexEditorGui.cpp:1277:2: error: 'chkHAVAL160' was not declared in this scope
    src/HexEditorGui.cpp:1277:20: error: expected type-specifier before 'wxCheckBox'
    src/HexEditorGui.cpp:1277:20: error: expected ';' before 'wxCheckBox'
    src/HexEditorGui.cpp:1280:2: error: 'chkHAVAL192' was not declared in this scope
    src/HexEditorGui.cpp:1280:20: error: expected type-specifier before 'wxCheckBox'
    src/HexEditorGui.cpp:1280:20: error: expected ';' before 'wxCheckBox'
    src/HexEditorGui.cpp:1283:2: error: 'chkHAVAL224' was not declared in this scope
    src/HexEditorGui.cpp:1283:20: error: expected type-specifier before 'wxCheckBox'
    src/HexEditorGui.cpp:1283:20: error: expected ';' before 'wxCheckBox'
    src/HexEditorGui.cpp:1286:2: error: 'chkHAVAL256' was not declared in this scope
    src/HexEditorGui.cpp:1286:20: error: expected type-specifier before 'wxCheckBox'
    src/HexEditorGui.cpp:1286:20: error: expected ';' before 'wxCheckBox'
    src/HexEditorGui.cpp:1292:20: error: 'sbSizerTIGER' was not declared in this scope
    src/HexEditorGui.cpp:1293:21: error: expected type-specifier before 'wxStaticBoxSizer'
    src/HexEditorGui.cpp:1293:21: error: expected ';' before 'wxStaticBoxSizer'
    src/HexEditorGui.cpp:1295:2: error: 'chkTIGER128' was not declared in this scope
    src/HexEditorGui.cpp:1295:20: error: expected type-specifier before 'wxCheckBox'
    src/HexEditorGui.cpp:1295:20: error: expected ';' before 'wxCheckBox'
    src/HexEditorGui.cpp:1298:2: error: 'chkTIGER160' was not declared in this scope
    src/HexEditorGui.cpp:1298:20: error: expected type-specifier before 'wxCheckBox'
    src/HexEditorGui.cpp:1298:20: error: expected ';' before 'wxCheckBox'
    src/HexEditorGui.cpp:1301:2: error: 'chkTIGER' was not declared in this scope
    src/HexEditorGui.cpp:1301:17: error: expected type-specifier before 'wxCheckBox'
    src/HexEditorGui.cpp:1301:17: error: expected ';' before 'wxCheckBox'
    src/HexEditorGui.cpp:1307:20: error: 'sbSizerOthers' was not declared in this scope
    src/HexEditorGui.cpp:1308:22: error: expected type-specifier before 'wxStaticBoxSizer'
    src/HexEditorGui.cpp:1308:22: error: expected ';' before 'wxStaticBoxSizer'
    src/HexEditorGui.cpp:1310:2: error: 'chkADLER32' was not declared in this scope
    src/HexEditorGui.cpp:1310:19: error: expected type-specifier before 'wxCheckBox'
    src/HexEditorGui.cpp:1310:19: error: expected ';' before 'wxCheckBox'
    src/HexEditorGui.cpp:1313:2: error: 'chkCRC32' was not declared in this scope
    src/HexEditorGui.cpp:1313:17: error: expected type-specifier before 'wxCheckBox'
    src/HexEditorGui.cpp:1313:17: error: expected ';' before 'wxCheckBox'
    src/HexEditorGui.cpp:1316:2: error: 'chkCRC32B' was not declared in this scope
    src/HexEditorGui.cpp:1316:18: error: expected type-specifier before 'wxCheckBox'
    src/HexEditorGui.cpp:1316:18: error: expected ';' before 'wxCheckBox'
    src/HexEditorGui.cpp:1319:2: error: 'chkWHIRLPOOL' was not declared in this scope
    src/HexEditorGui.cpp:1319:21: error: expected type-specifier before 'wxCheckBox'
    src/HexEditorGui.cpp:1319:21: error: expected ';' before 'wxCheckBox'
    src/HexEditorGui.cpp:1322:2: error: 'chkGOST' was not declared in this scope
    src/HexEditorGui.cpp:1322:16: error: expected type-specifier before 'wxCheckBox'
    src/HexEditorGui.cpp:1322:16: error: expected ';' before 'wxCheckBox'
    src/HexEditorGui.cpp:1325:2: error: 'chkSNEFRU128' was not declared in this scope
    src/HexEditorGui.cpp:1325:21: error: expected type-specifier before 'wxCheckBox'
    src/HexEditorGui.cpp:1325:21: error: expected ';' before 'wxCheckBox'
    src/HexEditorGui.cpp:1328:2: error: 'chkSNEFRU256' was not declared in this scope
    src/HexEditorGui.cpp:1328:21: error: expected type-specifier before 'wxCheckBox'
    src/HexEditorGui.cpp:1328:21: error: expected ';' before 'wxCheckBox'
    src/HexEditorGui.cpp:1340:96: error: invalid use of incomplete type 'class wxButton'
    In file included from src/HexEditorGui.h:24:0,
    from src/HexEditorGui.cpp:18:
    /usr/include/wx-2.8/wx/sizer.h:23:28: error: forward declaration of 'class wxButton'
    src/HexEditorGui.cpp:1341:78: error: invalid conversion from 'wxButton
    ' to 'int' [-fpermissive]
    In file included from src/HexEditorGui.h:24:0,
    from src/HexEditorGui.cpp:18:
    /usr/include/wx-2.8/wx/sizer.h:956:1: error: initializing argument 1 of 'wxSizerItem wxSizer::Add(int, int, int, int, int, wxObject)' [-fpermissive]
    src/HexEditorGui.cpp:1343:99: error: invalid use of incomplete type 'class wxButton'
    In file included from src/HexEditorGui.h:24:0,
    from src/HexEditorGui.cpp:18:
    /usr/include/wx-2.8/wx/sizer.h:23:28: error: forward declaration of 'class wxButton'
    src/HexEditorGui.cpp:1344:14: error: invalid use of incomplete type 'class wxButton'
    In file included from src/HexEditorGui.h:24:0,
    from src/HexEditorGui.cpp:18:
    /usr/include/wx-2.8/wx/sizer.h:23:28: error: forward declaration of 'class wxButton'
    src/HexEditorGui.cpp:1345:14: error: invalid use of incomplete type 'class wxButton'
    In file included from src/HexEditorGui.h:24:0,
    from src/HexEditorGui.cpp:18:
    /usr/include/wx-2.8/wx/sizer.h:23:28: error: forward declaration of 'class wxButton'
    src/HexEditorGui.cpp:1347:81: error: invalid conversion from 'wxButton' to 'int' [-fpermissive]
    In file included from src/HexEditorGui.h:24:0,
    from src/HexEditorGui.cpp:18:
    /usr/include/wx-2.8/wx/sizer.h:956:1: error: initializing argument 1 of 'wxSizerItem
    wxSizer::Add(int, int, int, int, int, wxObject)' [-fpermissive]
    src/HexEditorGui.cpp:1353:8: error: 'class ChecksumDialogGui' has no member named 'SetSizer'
    src/HexEditorGui.cpp:1354:8: error: 'class ChecksumDialogGui' has no member named 'Layout'
    src/HexEditorGui.cpp:1355:24: error: no matching function for call to 'wxBoxSizer::Fit(ChecksumDialogGui
    const)'
    src/HexEditorGui.cpp:1355:24: note: candidate is:
    In file included from src/HexEditorGui.h:24:0,
    from src/HexEditorGui.cpp:18:
    /usr/include/wx-2.8/wx/sizer.h:570:12: note: wxSize wxSizer::Fit(wxWindow)
    /usr/include/wx-2.8/wx/sizer.h:570:12: note: no known conversion for argument 1 from 'ChecksumDialogGui
    const' to 'wxWindow'
    src/HexEditorGui.cpp:1357:8: error: 'class ChecksumDialogGui' has no member named 'Centre'
    src/HexEditorGui.cpp:1360:107: error: 'wxCommandEventHandler' was not declared in this scope
    src/HexEditorGui.cpp:1361:21: error: 'wxEVT_COMMAND_FILEPICKER_CHANGED' was not declared in this scope
    src/HexEditorGui.cpp:1361:116: error: 'wxFileDirPickerEventHandler' was not declared in this scope
    src/HexEditorGui.cpp:1389:11: error: invalid use of incomplete type 'class wxButton'
    In file included from src/HexEditorGui.h:24:0,
    from src/HexEditorGui.cpp:18:
    /usr/include/wx-2.8/wx/sizer.h:23:28: error: forward declaration of 'class wxButton'
    src/HexEditorGui.cpp:1390:14: error: invalid use of incomplete type 'class wxButton'
    In file included from src/HexEditorGui.h:24:0,
    from src/HexEditorGui.cpp:18:
    /usr/include/wx-2.8/wx/sizer.h:23:28: error: forward declaration of 'class wxButton'
    src/HexEditorGui.cpp: In destructor 'ChecksumDialogGui::~ChecksumDialogGui()':
    src/HexEditorGui.cpp:1396:2: error: 'chkFile' was not declared in this scope
    src/HexEditorGui.cpp:1396:110: error: 'wxCommandEventHandler' was not declared in this scope
    src/HexEditorGui.cpp:1397:2: error: 'filePick' was not declared in this scope
    src/HexEditorGui.cpp:1397:24: error: 'wxEVT_COMMAND_FILEPICKER_CHANGED' was not declared in this scope
    src/HexEditorGui.cpp:1397:119: error: 'wxFileDirPickerEventHandler' was not declared in this scope
    src/HexEditorGui.cpp:1398:2: error: 'chkMD2' was not declared in this scope
    src/HexEditorGui.cpp:1399:2: error: 'chkMD4' was not declared in this scope
    src/HexEditorGui.cpp:1400:2: error: 'chkMD5' was not declared in this scope
    src/HexEditorGui.cpp:1401:2: error: 'chkSHA1' was not declared in this scope
    src/HexEditorGui.cpp:1402:2: error: 'chkSHA224' was not declared in this scope
    src/HexEditorGui.cpp:1403:2: error: 'chkSHA256' was not declared in this scope
    src/HexEditorGui.cpp:1404:2: error: 'chkSHA384' was not declared in this scope
    src/HexEditorGui.cpp:1405:2: error: 'chkSHA512' was not declared in this scope
    src/HexEditorGui.cpp:1406:2: error: 'chkRIPEMD128' was not declared in this scope
    src/HexEditorGui.cpp:1407:2: error: 'chkRIPEMD160' was not declared in this scope
    src/HexEditorGui.cpp:1408:2: error: 'chkRIPEMD256' was not declared in this scope
    src/HexEditorGui.cpp:1409:2: error: 'chkRIPEMD320' was not declared in this scope
    src/HexEditorGui.cpp:1410:2: error: 'chkHAVAL128' was not declared in this scope
    src/HexEditorGui.cpp:1411:2: error: 'chkHAVAL160' was not declared in this scope
    src/HexEditorGui.cpp:1412:2: error: 'chkHAVAL192' was not declared in this scope
    src/HexEditorGui.cpp:1413:2: error: 'chkHAVAL224' was not declared in this scope
    src/HexEditorGui.cpp:1414:2: error: 'chkHAVAL256' was not declared in this scope
    src/HexEditorGui.cpp:1415:2: error: 'chkTIGER128' was not declared in this scope
    src/HexEditorGui.cpp:1416:2: error: 'chkTIGER160' was not declared in this scope
    src/HexEditorGui.cpp:1417:2: error: 'chkTIGER' was not declared in this scope
    src/HexEditorGui.cpp:1418:2: error: 'chkADLER32' was not declared in this scope
    src/HexEditorGui.cpp:1419:2: error: 'chkCRC32' was not declared in this scope
    src/HexEditorGui.cpp:1420:2: error: 'chkCRC32B' was not declared in this scope
    src/HexEditorGui.cpp:1421:2: error: 'chkWHIRLPOOL' was not declared in this scope
    src/HexEditorGui.cpp:1422:2: error: 'chkGOST' was not declared in this scope
    src/HexEditorGui.cpp:1423:2: error: 'chkSNEFRU128' was not declared in this scope
    src/HexEditorGui.cpp:1424:2: error: 'chkSNEFRU256' was not declared in this scope
    src/HexEditorGui.cpp:1425:11: error: invalid use of incomplete type 'class wxButton'
    In file included from src/HexEditorGui.h:24:0,
    from src/HexEditorGui.cpp:18:
    /usr/include/wx-2.8/wx/sizer.h:23:28: error: forward declaration of 'class wxButton'
    src/HexEditorGui.cpp:1426:14: error: invalid use of incomplete type 'class wxButton'
    In file included from src/HexEditorGui.h:24:0,
    from src/HexEditorGui.cpp:18:
    /usr/include/wx-2.8/wx/sizer.h:23:28: error: forward declaration of 'class wxButton'
    src/HexEditorGui.cpp: In constructor 'CopyAsDialogGui::CopyAsDialogGui(wxWindow
    , wxWindowID, const wxString&, const wxPoint&, const wxSize&, long int)':
    src/HexEditorGui.cpp:1430:146: error: class 'CopyAsDialogGui' does not have any field named 'wxDialog'
    src/HexEditorGui.cpp:1432:8: error: 'class CopyAsDialogGui' has no member named 'SetSizeHints'
    src/HexEditorGui.cpp:1443:2: error: 'txtCopyAs' was not declared in this scope
    src/HexEditorGui.cpp:1443:18: error: expected type-specifier before 'wxStaticText'
    src/HexEditorGui.cpp:1443:18: error: expected ';' before 'wxStaticText'
    src/HexEditorGui.cpp:1449:2: error: 'chcCopyAs' was not declared in this scope
    src/HexEditorGui.cpp:1449:18: error: expected type-specifier before 'wxChoice'
    src/HexEditorGui.cpp:1449:18: error: expected ';' before 'wxChoice'
    src/HexEditorGui.cpp:1453:2: error: 'txtOption' was not declared in this scope
    src/HexEditorGui.cpp:1453:18: error: expected type-specifier before 'wxStaticText'
    src/HexEditorGui.cpp:1453:18: error: expected ';' before 'wxStaticText'
    src/HexEditorGui.cpp:1458:2: error: 'chcOption' was not declared in this scope
    src/HexEditorGui.cpp:1458:18: error: expected type-specifier before 'wxChoice'
    src/HexEditorGui.cpp:1458:18: error: expected ';' before 'wxChoice'
    src/HexEditorGui.cpp:1473:2: error: 'chkBigEndian' was not declared in this scope
    src/HexEditorGui.cpp:1473:21: error: expected type-specifier before 'wxCheckBox'
    src/HexEditorGui.cpp:1473:21: error: expected ';' before 'wxCheckBox'
    src/HexEditorGui.cpp:1478:2: error: 'wxStaticBoxSizer' was not declared in this scope
    src/HexEditorGui.cpp:1478:20: error: 'sbSizerBPL' was not declared in this scope
    src/HexEditorGui.cpp:1479:19: error: expected type-specifier before 'wxStaticBoxSizer'
    src/HexEditorGui.cpp:1479:19: error: expected ';' before 'wxStaticBoxSizer'
    src/HexEditorGui.cpp:1481:2: error: 'spnBytePerLine' was not declared in this scope
    src/HexEditorGui.cpp:1481:23: error: expected type-specifier before 'wxSpinCtrl'
    src/HexEditorGui.cpp:1481:23: error: expected ';' before 'wxSpinCtrl'
    src/HexEditorGui.cpp:1493:2: error: 'chkOffset' was not declared in this scope
    src/HexEditorGui.cpp:1493:18: error: expected type-specifier before 'wxCheckBox'
    src/HexEditorGui.cpp:1493:18: error: expected ';' before 'wxCheckBox'
    src/HexEditorGui.cpp:1497:2: error: 'chkHex' was not declared in this scope
    src/HexEditorGui.cpp:1497:15: error: expected type-specifier before 'wxCheckBox'
    src/HexEditorGui.cpp:1497:15: error: expected ';' before 'wxCheckBox'
    src/HexEditorGui.cpp:1501:2: error: 'chkText' was not declared in this scope
    src/HexEditorGui.cpp:1501:16: error: expected type-specifier before 'wxCheckBox'
    src/HexEditorGui.cpp:1501:16: error: expected ';' before 'wxCheckBox'
    src/HexEditorGui.cpp:1514:96: error: invalid use of incomplete type 'class wxButton'
    In file included from src/HexEditorGui.h:24:0,
    from src/HexEditorGui.cpp:18:
    /usr/include/wx-2.8/wx/sizer.h:23:28: error: forward declaration of 'class wxButton'
    src/HexEditorGui.cpp:1515:69: error: invalid conversion from 'wxButton' to 'int' [-fpermissive]
    In file included from src/HexEditorGui.h:24:0,
    from src/HexEditorGui.cpp:18:
    /usr/include/wx-2.8/wx/sizer.h:956:1: error: initializing argument 1 of 'wxSizerItem
    wxSizer::Add(int, int, int, int, int, wxObject)' [-fpermissive]
    src/HexEditorGui.cpp:1517:88: error: invalid use of incomplete type 'class wxButton'
    In file included from src/HexEditorGui.h:24:0,
    from src/HexEditorGui.cpp:18:
    /usr/include/wx-2.8/wx/sizer.h:23:28: error: forward declaration of 'class wxButton'
    src/HexEditorGui.cpp:1518:67: error: invalid conversion from 'wxButton
    ' to 'int' [-fpermissive]
    In file included from src/HexEditorGui.h:24:0,
    from src/HexEditorGui.cpp:18:
    /usr/include/wx-2.8/wx/sizer.h:956:1: error: initializing argument 1 of 'wxSizerItem wxSizer::Add(int, int, int, int, int, wxObject)' [-fpermissive]
    src/HexEditorGui.cpp:1524:8: error: 'class CopyAsDialogGui' has no member named 'SetSizer'
    src/HexEditorGui.cpp:1525:8: error: 'class CopyAsDialogGui' has no member named 'Layout'
    src/HexEditorGui.cpp:1526:24: error: no matching function for call to 'wxBoxSizer::Fit(CopyAsDialogGui const)'
    src/HexEditorGui.cpp:1526:24: note: candidate is:
    In file included from src/HexEditorGui.h:24:0,
    from src/HexEditorGui.cpp:18:
    /usr/include/wx-2.8/wx/sizer.h:570:12: note: wxSize wxSizer::Fit(wxWindow
    )
    /usr/include/wx-2.8/wx/sizer.h:570:12: note: no known conversion for argument 1 from 'CopyAsDialogGui const' to 'wxWindow'
    src/HexEditorGui.cpp:1528:8: error: 'class CopyAsDialogGui' has no member named 'Centre'
    src/HexEditorGui.cpp:1531:106: error: 'wxCommandEventHandler' was not declared in this scope
    src/HexEditorGui.cpp:1534:11: error: invalid use of incomplete type 'class wxButton'
    In file included from src/HexEditorGui.h:24:0,
    from src/HexEditorGui.cpp:18:
    /usr/include/wx-2.8/wx/sizer.h:23:28: error: forward declaration of 'class wxButton'
    src/HexEditorGui.cpp:1535:9: error: invalid use of incomplete type 'class wxButton'
    In file included from src/HexEditorGui.h:24:0,
    from src/HexEditorGui.cpp:18:
    /usr/include/wx-2.8/wx/sizer.h:23:28: error: forward declaration of 'class wxButton'
    src/HexEditorGui.cpp: In destructor 'CopyAsDialogGui::~CopyAsDialogGui()':
    src/HexEditorGui.cpp:1541:2: error: 'chcCopyAs' was not declared in this scope
    src/HexEditorGui.cpp:1541:109: error: 'wxCommandEventHandler' was not declared in this scope
    src/HexEditorGui.cpp:1542:2: error: 'chcOption' was not declared in this scope
    src/HexEditorGui.cpp:1543:2: error: 'chkBigEndian' was not declared in this scope
    src/HexEditorGui.cpp:1544:11: error: invalid use of incomplete type 'class wxButton'
    In file included from src/HexEditorGui.h:24:0,
    from src/HexEditorGui.cpp:18:
    /usr/include/wx-2.8/wx/sizer.h:23:28: error: forward declaration of 'class wxButton'
    src/HexEditorGui.cpp:1545:9: error: invalid use of incomplete type 'class wxButton'
    In file included from src/HexEditorGui.h:24:0,
    from src/HexEditorGui.cpp:18:
    /usr/include/wx-2.8/wx/sizer.h:23:28: error: forward declaration of 'class wxButton'
    src/HexEditorGui.cpp: In constructor 'XORViewDialogGui::XORViewDialogGui(wxWindow, wxWindowID, const wxString&, const wxPoint&, const wxSize&, long int)':
    src/HexEditorGui.cpp:1549:148: error: class 'XORViewDialogGui' does not have any field named 'wxDialog'
    src/HexEditorGui.cpp:1551:8: error: 'class XORViewDialogGui' has no member named 'SetSizeHints'
    src/HexEditorGui.cpp:1556:2: error: 'txtWarning' was not declared in this scope
    src/HexEditorGui.cpp:1556:19: error: expected type-specifier before 'wxStaticText'
    src/HexEditorGui.cpp:1556:19: error: expected ';' before 'wxStaticText'
    src/HexEditorGui.cpp:1563:2: error: 'txtSelection' was not declared in this scope
    src/HexEditorGui.cpp:1563:21: error: expected type-specifier before 'wxStaticText'
    src/HexEditorGui.cpp:1563:21: error: expected ';' before 'wxStaticText'
    src/HexEditorGui.cpp:1567:2: error: 'radioASCII' was not declared in this scope
    src/HexEditorGui.cpp:1567:19: error: expected type-specifier before 'wxRadioButton'
    src/HexEditorGui.cpp:1567:19: error: expected ';' before 'wxRadioButton'
    src/HexEditorGui.cpp:1571:2: error: 'radioHex' was not declared in this scope
    src/HexEditorGui.cpp:1571:17: error: expected type-specifier before 'wxRadioButton'
    src/HexEditorGui.cpp:1571:17: error: expected ';' before 'wxRadioButton'
    src/HexEditorGui.cpp:1574:2: error: 'XORtext' was not declared in this scope
    src/HexEditorGui.cpp:1574:16: error: expected type-specifier before 'wxTextCtrl'
    src/HexEditorGui.cpp:1574:16: error: expected ';' before 'wxTextCtrl'
    src/HexEditorGui.cpp:1584:96: error: invalid use of incomplete type 'class wxButton'
    In file included from src/HexEditorGui.h:24:0,
    from src/HexEditorGui.cpp:18:
    /usr/include/wx-2.8/wx/sizer.h:23:28: error: forward declaration of 'class wxButton'
    src/HexEditorGui.cpp:1585:45: error: invalid conversion from 'wxButton
    ' to 'int' [-fpermissive]
    In file included from src/HexEditorGui.h:24:0,
    from src/HexEditorGui.cpp:18:
    /usr/include/wx-2.8/wx/sizer.h:956:1: error: initializing argument 1 of 'wxSizerItem wxSizer::Add(int, int, int, int, int, wxObject)' [-fpermissive]
    src/HexEditorGui.cpp:1587:84: error: invalid use of incomplete type 'class wxButton'
    In file included from src/HexEditorGui.h:24:0,
    from src/HexEditorGui.cpp:18:
    /usr/include/wx-2.8/wx/sizer.h:23:28: error: forward declaration of 'class wxButton'
    src/HexEditorGui.cpp:1588:41: error: invalid conversion from 'wxButton' to 'int' [-fpermissive]
    In file included from src/HexEditorGui.h:24:0,
    from src/HexEditorGui.cpp:18:
    /usr/include/wx-2.8/wx/sizer.h:956:1: error: initializing argument 1 of 'wxSizerItem
    wxSizer::Add(int, int, int, int, int, wxObject)' [-fpermissive]
    src/HexEditorGui.cpp:1594:8: error: 'class XORViewDialogGui' has no member named 'SetSizer'
    src/HexEditorGui.cpp:1595:8: error: 'class XORViewDialogGui' has no member named 'Layout'
    src/HexEditorGui.cpp:1596:24: error: no matching function for call to 'wxBoxSizer::Fit(XORViewDialogGui
    const)'
    src/HexEditorGui.cpp:1596:24: note: candidate is:
    In file included from src/HexEditorGui.h:24:0,
    from src/HexEditorGui.cpp:18:
    /usr/include/wx-2.8/wx/sizer.h:570:12: note: wxSize wxSizer::Fit(wxWindow)
    /usr/include/wx-2.8/wx/sizer.h:570:12: note: no known conversion for argument 1 from 'XORViewDialogGui
    const' to 'wxWindow'
    src/HexEditorGui.cpp:1598:8: error: 'class XORViewDialogGui' has no member named 'Centre'
    src/HexEditorGui.cpp:1601:102: error: 'wxCommandEventHandler' was not declared in this scope
    src/HexEditorGui.cpp:1602:20: error: 'wxEVT_COMMAND_TEXT_ENTER' was not declared in this scope
    src/HexEditorGui.cpp:1603:11: error: invalid use of incomplete type 'class wxButton'
    In file included from src/HexEditorGui.h:24:0,
    from src/HexEditorGui.cpp:18:
    /usr/include/wx-2.8/wx/sizer.h:23:28: error: forward declaration of 'class wxButton'
    src/HexEditorGui.cpp:1604:7: error: invalid use of incomplete type 'class wxButton'
    In file included from src/HexEditorGui.h:24:0,
    from src/HexEditorGui.cpp:18:
    /usr/include/wx-2.8/wx/sizer.h:23:28: error: forward declaration of 'class wxButton'
    src/HexEditorGui.cpp: In destructor 'XORViewDialogGui::~XORViewDialogGui()':
    src/HexEditorGui.cpp:1610:2: error: 'XORtext' was not declared in this scope
    src/HexEditorGui.cpp:1610:105: error: 'wxCommandEventHandler' was not declared in this scope
    src/HexEditorGui.cpp:1611:23: error: 'wxEVT_COMMAND_TEXT_ENTER' was not declared in this scope
    src/HexEditorGui.cpp:1612:11: error: invalid use of incomplete type 'class wxButton'
    In file included from src/HexEditorGui.h:24:0,
    from src/HexEditorGui.cpp:18:
    /usr/include/wx-2.8/wx/sizer.h:23:28: error: forward declaration of 'class wxButton'
    src/HexEditorGui.cpp:1613:7: error: invalid use of incomplete type 'class wxButton'
    In file included from src/HexEditorGui.h:24:0,
    from src/HexEditorGui.cpp:18:
    /usr/include/wx-2.8/wx/sizer.h:23:28: error: forward declaration of 'class wxButton'
    src/HexEditorGui.cpp: In constructor 'PreferencesDialogGui::PreferencesDialogGui(wxWindow
    , wxWindowID, const wxString&, const wxPoint&, const wxSize&, long int)':
    src/HexEditorGui.cpp:1617:156: error: class 'PreferencesDialogGui' does not have any field named 'wxDialog'
    src/HexEditorGui.cpp:1619:8: error: 'class PreferencesDialogGui' has no member named 'SetSizeHints'
    src/HexEditorGui.cpp:1624:2: error: 'wxStaticBoxSizer' was not declared in this scope
    src/HexEditorGui.cpp:1624:20: error: 'sbSizerColour' was not declared in this scope
    src/HexEditorGui.cpp:1625:22: error: expected type-specifier before 'wxStaticBoxSizer'
    src/HexEditorGui.cpp:1625:22: error: expected ';' before 'wxStaticBoxSizer'
    src/HexEditorGui.cpp:1632:2: error: 'txtBtn' was not declared in this scope
    src/HexEditorGui.cpp:1632:15: error: expected type-specifier before 'wxStaticText'
    src/HexEditorGui.cpp:1632:15: error: expected ';' before 'wxStaticText'
    src/HexEditorGui.cpp:1636:2: error: 'clrPickerForeground' was not declared in this scope
    src/HexEditorGui.cpp:1636:28: error: expected type-specifier before 'wxColourPickerCtrl'
    src/HexEditorGui.cpp:1636:28: error: expected ';' before 'wxColourPickerCtrl'
    src/HexEditorGui.cpp:1641:2: error: 'clrPickerBackground' was not declared in this scope
    src/HexEditorGui.cpp:1641:28: error: expected type-specifier before 'wxColourPickerCtrl'
    src/HexEditorGui.cpp:1641:28: error: expected ';' before 'wxColourPickerCtrl'
    src/HexEditorGui.cpp:1646:2: error: 'clrPickerBackgroundZebra' was not declared in this scope
    src/HexEditorGui.cpp:1646:33: error: expected type-specifier before 'wxColourPickerCtrl'
    src/HexEditorGui.cpp:1646:33: error: expected ';' before 'wxColourPickerCtrl'
    src/HexEditorGui.cpp:1651:2: error: 'txtSelection' was not declared in this scope
    src/HexEditorGui.cpp:1651:21: error: expected type-specifier before 'wxStaticText'
    src/HexEditorGui.cpp:1651:21: error: expected ';' before 'wxStaticText'
    src/HexEditorGui.cpp:1655:2: error: 'clrPickerSelectionForeground' was not declared in this scope
    src/HexEditorGui.cpp:1655:37: error: expected type-specifier before 'wxColourPickerCtrl'
    src/HexEditorGui.cpp:1655:37: error: expected ';' before 'wxColourPickerCtrl'
    src/HexEditorGui.cpp:1660:2: error: 'clrPickerSelectionBackground' was not declared in this scope
    src/HexEditorGui.cpp:1660:37: error: expected type-specifier before 'wxColourPickerCtrl'
    src/HexEditorGui.cpp:1660:37: error: expected ';' before 'wxColourPickerCtrl'
    src/HexEditorGui.cpp:1665:98: error: invalid use of incomplete type 'class wxButton'
    In file included from src/HexEditorGui.h:24:0,
    from src/HexEditorGui.cpp:18:
    /usr/include/wx-2.8/wx/sizer.h:23:28: error: forward declaration of 'class wxButton'
    src/HexEditorGui.cpp:1666:17: error: invalid use of incomplete type 'class wxButton'
    In file included from src/HexEditorGui.h:24:0,
    from src/HexEditorGui.cpp:18:
    /usr/include/wx-2.8/wx/sizer.h:23:28: error: forward declaration of 'class wxButton'
    src/HexEditorGui.cpp:1668:85: error: invalid conversion from 'wxButton' to 'int' [-fpermissive]
    In file included from src/HexEditorGui.h:24:0,
    from src/HexEditorGui.cpp:18:
    /usr/include/wx-2.8/wx/sizer.h:956:1: error: initializing argument 1 of 'wxSizerItem
    wxSizer::Add(int, int, int, int, int, wxObject)' [-fpermissive]
    src/HexEditorGui.cpp:1679:2: error: 'txtLang' was not declared in this scope
    src/HexEditorGui.cpp:1679:16: error: expected type-specifier before 'wxStaticText'
    src/HexEditorGui.cpp:1679:16: error: expected ';' before 'wxStaticText'
    src/HexEditorGui.cpp:1684:2: error: 'chcLang' was not declared in this scope
    src/HexEditorGui.cpp:1684:16: error: expected type-specifier before 'wxChoice'
    src/HexEditorGui.cpp:1684:16: error: expected ';' before 'wxChoice'
    src/HexEditorGui.cpp:1694:2: error: 'txtCharacterFamily' was not declared in this scope
    src/HexEditorGui.cpp:1694:27: error: expected type-specifier before 'wxStaticText'
    src/HexEditorGui.cpp:1694:27: error: expected ';' before 'wxStaticText'
    src/HexEditorGui.cpp:1699:2: error: 'chcCharacterEncodingFamily' was not declared in this scope
    src/HexEditorGui.cpp:1699:35: error: expected type-specifier before 'wxChoice'
    src/HexEditorGui.cpp:1699:35: error: expected ';' before 'wxChoice'
    src/HexEditorGui.cpp:1709:2: error: 'txtCharacterEncoding' was not declared in this scope
    src/HexEditorGui.cpp:1709:29: error: expected type-specifier before 'wxStaticText'
    src/HexEditorGui.cpp:1709:29: error: expected ';' before 'wxStaticText'
    src/HexEditorGui.cpp:1714:2: error: 'chcCharacterEncoding' was not declared in this scope
    src/HexEditorGui.cpp:1714:29: error: expected type-specifier before 'wxChoice'
    src/HexEditorGui.cpp:1714:29: error: expected ';' before 'wxChoice'
    src/HexEditorGui.cpp:1718:2: error: 'txtfontSize' was not declared in this scope
    src/HexEditorGui.cpp:1718:20: error: expected type-specifier before 'wxStaticText'
    src/HexEditorGui.cpp:1718:20: error: expected ';' before 'wxStaticText'
    src/HexEditorGui.cpp:1722:2: error: 'spinFontSize' was not declared in this scope
    src/HexEditorGui.cpp:1722:21: error: expected type-specifier before 'wxSpinCtrl'
    src/HexEditorGui.cpp:1722:21: error: expected ';' before 'wxSpinCtrl'
    src/HexEditorGui.cpp:1728:20: error: 'sbSizerFormat' was not declared in this scope
    src/HexEditorGui.cpp:1729:22: error: expected type-specifier before 'wxStaticBoxSizer'
    src/HexEditorGui.cpp:1729:22: error: expected ';' before 'wxStaticBoxSizer'
    src/HexEditorGui.cpp:1737:2: error: 'comboCustomHexFormat' was not declared in this scope
    src/HexEditorGui.cpp:1737:29: error: expected type-specifier before 'wxComboBox'
    src/HexEditorGui.cpp:1737:29: error: expected ';' before 'wxComboBox'
    src/HexEditorGui.cpp:1746:2: error: 'chkCustom' was not declared in this scope
    src/HexEditorGui.cpp:1746:18: error: expected type-specifier before 'wxCheckBox'
    src/HexEditorGui.cpp:1746:18: error: expected ';' before 'wxCheckBox'
    src/HexEditorGui.cpp:1755:2: error: 'chkBytePerLineLimit' was not declared in this scope
    src/HexEditorGui.cpp:1755:28: error: expected type-specifier before 'wxCheckBox'
    src/HexEditorGui.cpp:1755:28: error: expected ';' before 'wxCheckBox'
    src/HexEditorGui.cpp:1758:2: error: 'spinBytePerLine' was not declared in this scope
    src/HexEditorGui.cpp:1758:24: error: expected type-specifier before 'wxSpinCtrl'
    src/HexEditorGui.cpp:1758:24: error: expected ';' before 'wxSpinCtrl'
    src/HexEditorGui.cpp:1772:2: error: 'chkAutoShowTagPanel' was not declared in this scope
    src/HexEditorGui.cpp:1772:28: error: expected type-specifier before 'wxCheckBox'
    src/HexEditorGui.cpp:1772:28: error: expected ';' before 'wxCheckBox'
    src/HexEditorGui.cpp:1782:90: error: invalid use of incomplete type 'class wxButton'
    In file included from src/HexEditorGui.h:24:0,
    from src/HexEditorGui.cpp:18:
    /usr/include/wx-2.8/wx/sizer.h:23:28: error: forward declaration of 'class wxButton'
    src/HexEditorGui.cpp:1783:73: error: invalid conversion from 'wxButton
    ' to 'int' [-fpermissive]
    In file included from src/HexEditorGui.h:24:0,
    from src/HexEditorGui.cpp:18:
    /usr/include/wx-2.8/wx/sizer.h:956:1: error: initializing argument 1 of 'wxSizerItem wxSizer::Add(int, int, int, int, int, wxObject)' [-fpermissive]
    src/HexEditorGui.cpp:1785:96: error: invalid use of incomplete type 'class wxButton'
    In file included from src/HexEditorGui.h:24:0,
    from src/HexEditorGui.cpp:18:
    /usr/include/wx-2.8/wx/sizer.h:23:28: error: forward declaration of 'class wxButton'
    src/HexEditorGui.cpp:1786:42: error: invalid conversion from 'wxButton' to 'int' [-fpermissive]
    In file included from src/HexEditorGui.h:24:0,
    from src/HexEditorGui.cpp:18:
    /usr/include/wx-2.8/wx/sizer.h:956:1: error: initializing argument 1 of 'wxSizerItem
    wxSizer::Add(int, int, int, int, int, wxObject)' [-fpermissive]
    src/HexEditorGui.cpp:1792:8: error: 'class PreferencesDialogGui' has no member named 'SetSizer'
    src/HexEditorGui.cpp:1793:8: error: 'class PreferencesDialogGui' has no member named 'Layout'
    src/HexEditorGui.cpp:1794:24: error: no matching function for call to 'wxBoxSizer::Fit(PreferencesDialogGui
    const)'
    src/HexEditorGui.cpp:1794:24: note: candidate is:
    In file included from src/HexEditorGui.h:24:0,
    from src/HexEditorGui.cpp:18:
    /usr/include/wx-2.8/wx/sizer.h:570:12: note: wxSize wxSizer::Fit(wxWindow)
    /usr/include/wx-2.8/wx/sizer.h:570:12: note: no known conversion for argument 1 from 'PreferencesDialogGui
    const' to 'wxWindow'
    src/HexEditorGui.cpp:1796:8: error: 'class PreferencesDialogGui' has no member named 'Centre'
    src/HexEditorGui.cpp:1799:17: error: invalid use of incomplete type 'class wxButton'
    In file included from src/HexEditorGui.h:24:0,
    from src/HexEditorGui.cpp:18:
    /usr/include/wx-2.8/wx/sizer.h:23:28: error: forward declaration of 'class wxButton'
    src/HexEditorGui.cpp:1799:118: error: 'wxCommandEventHandler' was not declared in this scope
    src/HexEditorGui.cpp:1802:116: error: 'wxSpinEventHandler' was not declared in this scope
    src/HexEditorGui.cpp:1806:9: error: invalid use of incomplete type 'class wxButton'
    In file included from src/HexEditorGui.h:24:0,
    from src/HexEditorGui.cpp:18:
    /usr/include/wx-2.8/wx/sizer.h:23:28: error: forward declaration of 'class wxButton'
    src/HexEditorGui.cpp: In destructor 'PreferencesDialogGui::~PreferencesDialogGui()':
    src/HexEditorGui.cpp:1812:17: error: invalid use of incomplete type 'class wxButton'
    In file included from src/HexEditorGui.h:24:0,
    from src/HexEditorGui.cpp:18:
    /usr/include/wx-2.8/wx/sizer.h:23:28: error: forward declaration of 'class wxButton'
    src/HexEditorGui.cpp:1812:121: error: 'wxCommandEventHandler' was not declared in this scope
    src/HexEditorGui.cpp:1813:2: error: 'chcCharacterEncodingFamily' was not declared in this scope
    src/HexEditorGui.cpp:1814:2: error: 'chcCharacterEncoding' was not declared in this scope
    src/HexEditorGui.cpp:1815:2: error: 'spinFontSize' was not declared in this scope
    src/HexEditorGui.cpp:1815:119: error: 'wxSpinEventHandler' was not declared in this scope
    src/HexEditorGui.cpp:1817:2: error: 'chkCustom' was not declared in this scope
    src/HexEditorGui.cpp:1818:2: error: 'chkBytePerLineLimit' was not declared in this scope
    src/HexEditorGui.cpp:1819:9: error: invalid use of incomplete type 'class wxButton'
    In file included from src/HexEditorGui.h:24:0,
    from src/HexEditorGui.cpp:18:
    /usr/include/wx-2.8/wx/sizer.h:23:28: error: forward declaration of 'class wxButton'
    src/HexEditorGui.cpp: In constructor 'DeviceBackupDialogGui::DeviceBackupDialogGui(wxWindow
    , wxWindowID, const wxString&, const wxPoint&, const wxSize&, long int)':
    src/HexEditorGui.cpp:1823:158: error: class 'DeviceBackupDialogGui' does not have any field named 'wxDialog'
    src/HexEditorGui.cpp:1825:8: error: 'class DeviceBackupDialogGui' has no member named 'SetSizeHints'
    src/HexEditorGui.cpp:1836:2: error: 'txtSource' was not declared in this scope
    src/HexEditorGui.cpp:1836:18: error: expected type-specifier before 'wxStaticText'
    src/HexEditorGui.cpp:1836:18: error: expected ';' before 'wxStaticText'
    src/HexEditorGui.cpp:1841:2: error: 'chcPartition' was not declared in this scope
    src/HexEditorGui.cpp:1841:21: error: expected type-specifier before 'wxChoice'
    src/HexEditorGui.cpp:1841:21: error: expected ';' before 'wxChoice'
    src/HexEditorGui.cpp:1845:2: error: 'txtDestination' was not declared in this scope
    src/HexEditorGui.cpp:1845:23: error: expected type-specifier before 'wxStaticText'
    src/HexEditorGui.cpp:1845:23: error: expected ';' before 'wxStaticText'
    src/HexEditorGui.cpp:1849:2: error: 'filePickBackup' was not declared in this scope
    src/HexEditorGui.cpp:1849:23: error: expected type-specifier before 'wxFilePickerCtrl'
    src/HexEditorGui.cpp:1849:23: error: expected ';' before 'wxFilePickerCtrl'
    src/HexEditorGui.cpp:1858:93: error: invalid use of incomplete type 'class wxButton'
    In file included from src/HexEditorGui.h:24:0,
    from src/HexEditorGui.cpp:18:
    /usr/include/wx-2.8/wx/sizer.h:23:28: error: forward declaration of 'class wxButton'
    src/HexEditorGui.cpp:1859:67: error: invalid conversion from 'wxButton' to 'int' [-fpermissive]
    In file included from src/HexEditorGui.h:24:0,
    from src/HexEditorGui.cpp:18:
    /usr/include/wx-2.8/wx/sizer.h:956:1: error: initializing argument 1 of 'wxSizerItem
    wxSizer::Add(int, int, int, int, int, wxObject)' [-fpermissive]
    src/HexEditorGui.cpp:1861:96: error: invalid use of incomplete type 'class wxButton'
    In file included from src/HexEditorGui.h:24:0,
    from src/HexEditorGui.cpp:18:
    /usr/include/wx-2.8/wx/sizer.h:23:28: error: forward declaration of 'class wxButton'
    src/HexEditorGui.cpp:1862:67: error: invalid conversion from 'wxButton
    ' to 'int' [-fpermissive]
    In file included from src/HexEditorGui.h:24:0,
    from src/HexEditorGui.cpp:18:
    /usr/include/wx-2.8/wx/sizer.h:956:1: error: initializing argument 1 of 'wxSizerItem wxSizer::Add(int, int, int, int, int, wxObject)' [-fpermissive]
    src/HexEditorGui.cpp:1868:8: error: 'class DeviceBackupDialogGui' has no member named 'SetSizer'
    src/HexEditorGui.cpp:1869:8: error: 'class DeviceBackupDialogGui' has no member named 'Layout'
    src/HexEditorGui.cpp:1871:8: error: 'class DeviceBackupDialogGui' has no member named 'Centre'
    src/HexEditorGui.cpp:1874:11: error: invalid use of incomplete type 'class wxButton'
    In file included from src/HexEditorGui.h:24:0,
    from src/HexEditorGui.cpp:18:
    /usr/include/wx-2.8/wx/sizer.h:23:28: error: forward declaration of 'class wxButton'
    src/HexEditorGui.cpp:1874:107: error: 'wxCommandEventHandler' was not declared in this scope
    src/HexEditorGui.cpp: In destructor 'DeviceBackupDialogGui::~DeviceBackupDialogGui()':
    src/HexEditorGui.cpp:1880:11: error: invalid use of incomplete type 'class wxButton'
    In file included from src/HexEditorGui.h:24:0,
    from src/HexEditorGui.cpp:18:
    /usr/include/wx-2.8/wx/sizer.h:23:28: error: forward declaration of 'class wxButton'
    src/HexEditorGui.cpp:1880:110: error: 'wxCommandEventHandler' was not declared in this scope
    src/HexEditorGui.cpp: In constructor 'DeviceRestoreDialogGui::DeviceRestoreDialogGui(wxWindow, wxWindowID, const wxString&, const wxPoint&, const wxSize&, long int)':
    src/HexEditorGui.cpp:1884:160: error: class 'DeviceRestoreDialogGui' does not have any field named 'wxDialog'
    src/HexEditorGui.cpp:1886:8: error: 'class DeviceRestoreDialogGui' has no member named 'SetSizeHints'
    src/HexEditorGui.cpp:1897:2: error: 'txtSource' was not declared in this scope
    src/HexEditorGui.cpp:1897:18: error: expected type-specifier before 'wxStaticText'
    src/HexEditorGui.cpp:1897:18: error: expected ';' before 'wxStaticText'
    src/HexEditorGui.cpp:1901:2: error: 'filePickBackup' was not declared in this scope
    src/HexEditorGui.cpp:1901:23: error: expected type-specifier before 'wxFilePickerCtrl'
    src/HexEditorGui.cpp:1901:23: error: expected ';' before 'wxFilePickerCtrl'
    src/HexEditorGui.cpp:1904:2: error: 'txtDestination' was not declared in this scope
    src/HexEditorGui.cpp:1904:23: error: expected type-specifier before 'wxStaticText'
    src/HexEditorGui.cpp:1904:23: error: expected ';' before 'wxStaticText'
    src/HexEditorGui.cpp:1909:2: error: 'chcPartition' was not declared in this scope
    src/HexEditorGui.cpp:1909:21: error: expected type-specifier before 'wxChoice'
    src/HexEditorGui.cpp:1909:21: error: expected ';' before 'wxChoice'
    src/HexEditorGui.cpp:1919:95: error: invalid use of incomplete type 'class wxButton'
    In file included from src/HexEditorGui.h:24:0,
    from src/HexEditorGui.cpp:18:
    /usr/include/wx-2.8/wx/sizer.h:23:28: error: forward declaration of 'class wxButton'
    src/HexEditorGui.cpp:1920:68: error: invalid conversion from 'wxButton
    ' to 'int' [-fpermissive]
    In file included from src/HexEditorGui.h:24:0,
    from src/HexEditorGui.cpp:18:
    /usr/include/wx-2.8/wx/sizer.h:956:1: error: initializing argument 1 of 'wxSizerItem wxSizer::Add(int, int, int, int, int, wxObject)' [-fpermissive]
    src/HexEditorGui.cpp:1922:96: error: invalid use of incomplete type 'class wxButton'
    In file included from src/HexEditorGui.h:24:0,
    from src/HexEditorGui.cpp:18:
    /usr/include/wx-2.8/wx/sizer.h:23:28: error: forward declaration of 'class wxButton'
    src/HexEditorGui.cpp:1923:67: error: invalid conversion from 'wxButton' to 'int' [-fpermissive]
    In file included from src/HexEditorGui.h:24:0,
    from src/HexEditorGui.cpp:18:
    /usr/include/wx-2.8/wx/sizer.h:956:1: error: initializing argument 1 of 'wxSizerItem
    wxSizer::Add(int, int, int, int, int, wxObject)' [-fpermissive]
    src/HexEditorGui.cpp:1929:8: error: 'class DeviceRestoreDialogGui' has no member named 'SetSizer'
    src/HexEditorGui.cpp:1930:8: error: 'class DeviceRestoreDialogGui' has no member named 'Layout'
    src/HexEditorGui.cpp:1932:8: error: 'class DeviceRestoreDialogGui' has no member named 'Centre'
    src/HexEditorGui.cpp:1935:12: error: invalid use of incomplete type 'class wxButton'
    In file included from src/HexEditorGui.h:24:0,
    from src/HexEditorGui.cpp:18:
    /usr/include/wx-2.8/wx/sizer.h:23:28: error: forward declaration of 'class wxButton'
    src/HexEditorGui.cpp:1935:110: error: 'wxCommandEventHandler' was not declared in this scope
    src/HexEditorGui.cpp: In destructor 'DeviceRestoreDialogGui::~DeviceRestoreDialogGui()':
    src/HexEditorGui.cpp:1941:12: error: invalid use of incomplete type 'class wxButton'
    In file included from src/HexEditorGui.h:24:0,
    from src/HexEditorGui.cpp:18:
    /usr/include/wx-2.8/wx/sizer.h:23:28: error: forward declaration of 'class wxButton'
    src/HexEditorGui.cpp:1941:113: error: 'wxCommandEventHandler' was not declared in this scope
    src/HexEditorGui.cpp: In constructor 'DeviceEraseDialogGui::DeviceEraseDialogGui(wxWindow
    , wxWindowID, const wxString&, const wxPoint&, const wxSize&, long int)':
    src/HexEditorGui.cpp:1945:156: error: class 'DeviceEraseDialogGui' does not have any field named 'wxDialog'
    src/HexEditorGui.cpp:1947:8: error: 'class DeviceEraseDialogGui' has no member named 'SetSizeHints'
    src/HexEditorGui.cpp:1958:2: error: 'txtDestination' was not declared in this scope
    src/HexEditorGui.cpp:1958:23: error: expected type-specifier before 'wxStaticText'
    src/HexEditorGui.cpp:1958:23: error: expected ';' before 'wxStaticText'
    src/HexEditorGui.cpp:1963:2: error: 'chcPartition' was not declared in this scope
    src/HexEditorGui.cpp:1963:21: error: expected type-specifier before 'wxChoice'
    src/HexEditorGui.cpp:1963:21: error: expected ';' before 'wxChoice'
    src/HexEditorGui.cpp:1972:2: error: 'radioErase' was not declared in this scope
    src/HexEditorGui.cpp:1972:19: error: expected type-specifier before 'wxRadioBox'
    src/HexEditorGui.cpp:1972:19: error: expected ';' before 'wxRadioBox'
    src/HexEditorGui.cpp:1979:91: error: invalid use of incomplete type 'class wxButton'
    In file included from src/HexEditorGui.h:24:0,
    from src/HexEditorGui.cpp:18:
    /usr/include/wx-2.8/wx/sizer.h:23:28: error: forward declaration of 'class wxButton'
    src/HexEditorGui.cpp:1980:66: error: invalid conversion from 'wxButton' to 'int' [-fpermissive]
    In file included from src/HexEditorGui.h:24:0,
    from src/HexEditorGui.cpp:18:
    /usr/include/wx-2.8/wx/sizer.h:956:1: error: initializing argument 1 of 'wxSizerItem
    wxSizer::Add(int, int, int, int, int, wxObject)' [-fpermissive]
    src/HexEditorGui.cpp:1982:96: error: invalid use of incomplete type 'class wxButton'
    In file included from src/HexEditorGui.h:24:0,
    from src/HexEditorGui.cpp:18:
    /usr/include/wx-2.8/wx/sizer.h:23:28: error: forward declaration of 'class wxButton'
    src/HexEditorGui.cpp:1983:67: error: invalid conversion from 'wxButton
    ' to 'int' [-fpermissive]
    In file included from src/HexEditorGui.h:24:0,
    from src/HexEditorGui.cpp:18:
    /usr/include/wx-2.8/wx/sizer.h:956:1: error: initializing argument 1 of 'wxSizerItem wxSizer::Add(int, int, int, int, int, wxObject)' [-fpermissive]
    src/HexEditorGui.cpp:1989:8: error: 'class DeviceEraseDialogGui' has no member named 'SetSizer'
    src/HexEditorGui.cpp:1990:8: error: 'class DeviceEraseDialogGui' has no member named 'Layout'
    src/HexEditorGui.cpp:1992:8: error: 'class DeviceEraseDialogGui' has no member named 'Centre'
    src/HexEditorGui.cpp:1995:10: error: invalid use of incomplete type 'class wxButton'
    In file included from src/HexEditorGui.h:24:0,
    from src/HexEditorGui.cpp:18:
    /usr/include/wx-2.8/wx/sizer.h:23:28: error: forward declaration of 'class wxButton'
    src/HexEditorGui.cpp:1995:104: error: 'wxCommandEventHandler' was not declared in this scope
    src/HexEditorGui.cpp: In destructor 'DeviceEraseDialogGui::~DeviceEraseDialogGui()':
    src/HexEditorGui.cpp:2001:10: error: invalid use of incomplete type 'class wxButton'
    In file included from src/HexEditorGui.h:24:0,
    from src/HexEditorGui.cpp:18:
    /usr/include/wx-2.8/wx/sizer.h:23:28: error: forward declaration of 'class wxButton'
    src/HexEditorGui.cpp:2001:107: error: 'wxCommandEventHandler' was not declared in this scope
    src/HexEditorGui.cpp: In constructor 'DebugFrame::DebugFrame(wxWindow, wxWindowID, const wxString&, const wxPoint&, const wxSize&, long int)':
    src/HexEditorGui.cpp:2005:136: error: type 'wxFrame' is not a direct base of 'DebugFrame'
    src/HexEditorGui.cpp:2007:8: error: 'class DebugFrame' has no member named 'SetSizeHints'
    src/HexEditorGui.cpp:2012:2: error: 'm_textCtrl' was not declared in this scope
    src/HexEditorGui.cpp:2012:19: error: expected type-specifier before 'wxTextCtrl'
    src/HexEditorGui.cpp:2012:19: error: expected ';' before 'wxTextCtrl'
    src/HexEditorGui.cpp:2017:8: error: 'class DebugFrame' has no member named 'SetSizer'
    src/HexEditorGui.cpp:2018:8: error: 'class DebugFrame' has no member named 'Layout'
    src/HexEditorGui.cpp:2020:8: error: 'class DebugFrame' has no member named 'Centre'
    src/HexEditorGui.cpp: In constructor 'OSXMessageDialogGui::OSXMessageDialogGui(wxWindow
    , wxWindowID, const wxString&, const wxPoint&, const wxSize&, long int)':
    src/HexEditorGui.cpp:2027:154: error: class 'OSXMessageDialogGui' does not have any field named 'wxDialog'
    src/HexEditorGui.cpp:2029:8: error: 'class OSXMessageDialogGui' has no member named 'SetSizeHints'
    src/HexEditorGui.cpp:2034:2: error: 'icon_bitmap' was not declared in this scope
    src/HexEditorGui.cpp:2034:20: error: expected type-specifier before 'wxStaticBitmap'
    src/HexEditorGui.cpp:2034:20: error: expected ';' before 'wxStaticBitmap'
    src/HexEditorGui.cpp:2040:2: error: 'txtCaption' was not declared in this scope
    src/HexEditorGui.cpp:2040:19: error: expected type-specifier before 'wxStaticText'
    src/HexEditorGui.cpp:2040:19: error: expected ';' before 'wxStaticText'
    src/HexEditorGui.cpp:2042:44: error: invalid use of incomplete type 'const class wxFont'
    In file included from /usr/include/wx-2.8/wx/bitmap.h:20:0,
    from /usr/include/wx-2.8/wx/artprov.h:16,
    from src/HexEditorGui.h:11,
    from src/HexEditorGui.cpp:18:
    /usr/include/wx-2.8/wx/gdicmn.h:34:28: error: forward declaration of 'const class wxFont'
    src/HexEditorGui.cpp:2042:95: error: invalid use of incomplete type 'class wxFont'
    In file included from /usr/include/wx-2.8/wx/bitmap.h:20:0,
    from /usr/include/wx-2.8/wx/artprov.h:16,
    from src/HexEditorGui.h:11,
    from src/HexEditorGui.cpp:18:
    /usr/include/wx-2.8/wx/gdicmn.h:34:28: error: forward declaration of 'class wxFont'
    src/HexEditorGui.cpp:2046:2: error: 'txtMessage' was not declared in this scope
    src/HexEditorGui.cpp:2046:19: error: expected type-specifier before 'wxStaticText'
    src/HexEditorGui.cpp:2046:19: error: expected ';' before 'wxStaticText'
    src/HexEditorGui.cpp:2050:84: error: invalid use of incomplete type 'class wxButton'
    In file included from src/HexEditorGui.h:24:0,
    from src/HexEditorGui.cpp:18:
    /usr/include/wx-2.8/wx/sizer.h:23:28: error: forward declaration of 'class wxButton'
    src/HexEditorGui.cpp:2051:50: error: invalid conversion from 'wxButton' to 'int' [-fpermissive]
    In file included from src/HexEditorGui.h:24:0,
    from src/HexEditorGui.cpp:18:
    /usr/include/wx-2.8/wx/sizer.h:956:1: error: initializing argument 1 of 'wxSizerItem
    wxSizer::Add(int, int, int, int, int, wxObject)' [-fpermissive]
    src/HexEditorGui.cpp:2057:8: error: 'class OSXMessageDialogGui' has no member named 'SetSizer'
    src/HexEditorGui.cpp:2058:8: error: 'class OSXMessageDialogGui' has no member named 'Layout'
    src/HexEditorGui.cpp:2059:24: error: no matching function for call to 'wxBoxSizer::Fit(OSXMessageDialogGui
    const)'
    src/HexEditorGui.cpp:2059:24: note: candidate is:
    In file included from src/HexEditorGui.h:24:0,
    from src/HexEditorGui.cpp:18:
    /usr/include/wx-2.8/wx/sizer.h:570:12: note: wxSize wxSizer::Fit(wxWindow)
    /usr/include/wx-2.8/wx/sizer.h:570:12: note: no known conversion for argument 1 from 'OSXMessageDialogGui
    const' to 'wxWindow'
    src/HexEditorGui.cpp:2061:8: error: 'class OSXMessageDialogGui' has no member named 'Centre'
    make:
    ** [src/HexEditorGui.o] Error 1

     
  • Death Knight®
    Death Knight®
    2014-02-03

    Looks pike yolu do not installed wxWidgets library properly.
    wxHexEditor needs wxWidgets developer packages. Please retry arter installing wx devel libraries. (Don't remember exact name)

    Or

    Just download precompiled binaries somewhere (I believe someone build them already). Just search for it.
    Thanks,