#113 bsdl_config.h missing

open
nobody
None
5
2011-05-25
2011-05-25
Márton Miklós
No

The compilation process of the svn rev 1907 fails with:

make[3]: Entering directory `/home/mm/Projektek/urjtag/src/svf'
CC svf.lo
CCLD libsvf.la
CC libsvf_flex_la-svf_flex.lo
svf_flex.c:4187:5: warning: no previous prototype for ‘urj_svf_get_column’
svf_flex.c:4263:6: warning: no previous prototype for ‘urj_svf_set_column’
svf_flex.c:3658:17: warning: ‘yyunput’ defined but not used
svf_flex.c:3700:16: warning: ‘input’ defined but not used
CCLD libsvf_flex.la
make[3]: Leaving directory `/home/mm/Projektek/urjtag/src/svf'
Making all in bsdl
make[3]: Entering directory `/home/mm/Projektek/urjtag/src/bsdl'
CC vhdl_bison.lo
In file included from vhdl_bison.y:133:0:
bsdl_sysdep.h:29:25: fatal error: bsdl_config.h: Nincs ilyen fájl vagy könyvtár
compilation terminated.
make[3]: *** [vhdl_bison.lo] Error 1
make[3]: Leaving directory `/home/mm/Projektek/urjtag/src/bsdl'
make[2]: *** [all-recursive] Error 1
make[2]: Leaving directory `/home/mm/Projektek/urjtag/src'
make[1]: *** [all-recursive] Error 1
make[1]: Leaving directory `/home/mm/Projektek/urjtag'
make: *** [all] Error 2
mm@lapos:~/Projektek/urjtag$

I have tested with Ubuntu 11.04 x86_64, and similar happended on my friend's gentoo based machine.

Discussion