#43 Not compiling 2.4.2.1 on Gentoo ...

open
nobody
None
5
16 hours ago
2011-09-15
Anonymous
No

Here is my gcc information:

Reading specs from /usr/lib/gcc-lib/i686-pc-linux-gnu/3.2.3/specs
Configured with: /var/tmp/portage/gcc-3.2.3-r1/work/gcc-3.2.3/configure --prefix=/usr --bindir=/usr/i686-pc-linux-gnu/gcc-bin/3.2 --includedir=/usr/lib/gcc-lib/i686-pc-linux-gnu/3.2.3/include --datadir=/usr/share/gcc-data/i686-pc-linux-gnu/3.2 --mandir=/usr/share/gcc-data/i686-pc-linux-gnu/3.2/man --infodir=/usr/share/gcc-data/i686-pc-linux-gnu/3.2/info --enable-shared --host=i686-pc-linux-gnu --target=i686-pc-linux-gnu --with-system-zlib --enable-languages=c,c++,ada,f77,objc,java --enable-threads=posix --enable-long-long --disable-checking --enable-cstdio=stdio --enable-clocale=generic --enable-__cxa_atexit --enable-version-specific-runtime-libs --with-gxx-include-dir=/usr/lib/gcc-lib/i686-pc-linux-gnu/3.2.3/include/g++-v3 --with-local-prefix=/usr/local --enable-shared --enable-nls --without-included-gettext
Thread model: posix
gcc version 3.2.3 20030422 (Gentoo Linux 1.4 3.2.3-r1, propolice)

Here is the output from make:

checking build system type... i686-pc-linux-gnu
checking host system type... i686-pc-linux-gnu
checking target system type... i686-pc-linux-gnu
checking for a BSD-compatible install... /usr/bin/install -c
checking whether build environment is sane... yes
checking for gawk... gawk
checking whether make sets $(MAKE)... yes
checking for gcc... gcc
checking for C compiler default output file name... a.out
checking whether the C compiler works... yes
checking whether we are cross compiling... no
checking for suffix of executables...
checking for suffix of object files... o
checking whether we are using the GNU C compiler... yes
checking whether gcc accepts -g... yes
checking for gcc option to accept ISO C89... none needed
checking for style of include used by make... GNU
checking dependency style of gcc... none
checking for g++... g++
checking whether we are using the GNU C++ compiler... yes
checking whether g++ accepts -g... yes
checking dependency style of g++... none
checking for ranlib... ranlib
checking for bison... bison -y
checking for vi... /usr/bin/vi
checking for sendmail... no
checking how to run the C preprocessor... gcc -E
checking for grep that handles long lines and -e... /bin/grep
checking for egrep... /bin/grep -E
checking for ANSI C header files... yes
checking for sys/types.h... yes
checking for sys/stat.h... yes
checking for stdlib.h... yes
checking for string.h... yes
checking for memory.h... yes
checking for strings.h... yes
checking for inttypes.h... yes
checking for stdint.h... yes
checking for unistd.h... yes
checking sys/param.h usability... yes
checking sys/param.h presence... yes
checking for sys/param.h... yes
checking for sys/mount.h... yes
checking sys/ustat.h usability... yes
checking sys/ustat.h presence... yes
checking for sys/ustat.h... yes
checking sys/sysmacros.h usability... yes
checking sys/sysmacros.h presence... yes
checking for sys/sysmacros.h... yes
checking sys/syslog.h usability... yes
checking sys/syslog.h presence... yes
checking for sys/syslog.h... yes
checking for unistd.h... (cached) yes
checking syslog.h usability... yes
checking syslog.h presence... yes
checking for syslog.h... yes
checking iconv.h usability... yes
checking iconv.h presence... yes
checking for iconv.h... yes
checking langinfo.h usability... yes
checking langinfo.h presence... yes
checking for langinfo.h... yes
checking sys/statfs.h usability... yes
checking sys/statfs.h presence... yes
checking for sys/statfs.h... yes
checking signum.h usability... no
checking signum.h presence... no
checking for signum.h... no
checking bits/signum.h usability... yes
checking bits/signum.h presence... yes
checking for bits/signum.h... yes
checking stdarg.h usability... yes
checking stdarg.h presence... yes
checking for stdarg.h... yes
checking malloc.h usability... yes
checking malloc.h presence... yes
checking for malloc.h... yes
checking for an ANSI C-conforming const... yes
checking for size_t... yes
checking whether time.h and sys/time.h may both be included... yes
checking whether byte ordering is bigendian... no
checking for int... yes
checking size of int... 4
checking for long... yes
checking size of long... 4
checking for long long... yes
checking size of long long... 8
checking for strftime... yes
checking for gethostname... yes
checking for gethostid... yes
checking for mkstemp... yes
checking for socket in -lc... yes
checking for gethostbyname in -lc... yes
checking how to run the C++ preprocessor... g++ -E
checking locale usability... yes
checking locale presence... yes
checking for locale... yes
checking wchar.h usability... yes
checking wchar.h presence... yes
checking for wchar.h... yes
checking for OpenSSL directory... /usr
checking openssl/md5.h usability... yes
checking openssl/md5.h presence... yes
checking for openssl/md5.h... yes
checking openssl/sha.h usability... yes
checking openssl/sha.h presence... yes
checking for openssl/sha.h... yes
configure: creating ./config.status
config.status: creating Makefile
config.status: creating man/Makefile
config.status: creating man/man4/Makefile
config.status: creating man/man5/Makefile
config.status: creating man/man8/Makefile
config.status: creating src/Makefile
config.status: creating src/cryptlib/Makefile
config.status: creating src/core/Makefile
config.status: creating src/db/Makefile
config.status: creating src/fco/Makefile
config.status: creating src/fs/Makefile
config.status: creating src/tw/Makefile
config.status: creating src/twcrypto/Makefile
config.status: creating src/twparser/Makefile
config.status: creating src/util/Makefile
config.status: creating src/twprint/Makefile
config.status: creating src/twadmin/Makefile
config.status: creating src/siggen/Makefile
config.status: creating src/tripwire/Makefile
config.status: creating config.h
config.status: executing depfiles commands
make all-recursive
make[1]: Entering directory `/tmp/ats_security/tripwire-2.4.2.1'
Making all in man
make[2]: Entering directory `/tmp/ats_security/tripwire-2.4.2.1/man'
Making all in man4
make[3]: Entering directory `/tmp/ats_security/tripwire-2.4.2.1/man/man4'
make[3]: Nothing to be done for `all'.
make[3]: Leaving directory `/tmp/ats_security/tripwire-2.4.2.1/man/man4'
Making all in man5
make[3]: Entering directory `/tmp/ats_security/tripwire-2.4.2.1/man/man5'
make[3]: Nothing to be done for `all'.
make[3]: Leaving directory `/tmp/ats_security/tripwire-2.4.2.1/man/man5'
Making all in man8
make[3]: Entering directory `/tmp/ats_security/tripwire-2.4.2.1/man/man8'
make[3]: Nothing to be done for `all'.
make[3]: Leaving directory `/tmp/ats_security/tripwire-2.4.2.1/man/man8'
make[3]: Entering directory `/tmp/ats_security/tripwire-2.4.2.1/man'
make[3]: Nothing to be done for `all-am'.
make[3]: Leaving directory `/tmp/ats_security/tripwire-2.4.2.1/man'
make[2]: Leaving directory `/tmp/ats_security/tripwire-2.4.2.1/man'
Making all in src
make[2]: Entering directory `/tmp/ats_security/tripwire-2.4.2.1/src'
Making all in cryptlib
make[3]: Entering directory `/tmp/ats_security/tripwire-2.4.2.1/src/cryptlib'
g++ -DHAVE_CONFIG_H -I.. -I../.. -O -pipe -Wall -Wno-non-virtual-dtor -c -o algebra.o algebra.cpp
g++ -DHAVE_CONFIG_H -I.. -I../.. -O -pipe -Wall -Wno-non-virtual-dtor -c -o asn.o asn.cpp
g++ -DHAVE_CONFIG_H -I.. -I../.. -O -pipe -Wall -Wno-non-virtual-dtor -c -o cryptlib.o cryptlib.cpp
g++ -DHAVE_CONFIG_H -I.. -I../.. -O -pipe -Wall -Wno-non-virtual-dtor -c -o des.o des.cpp
g++ -DHAVE_CONFIG_H -I.. -I../.. -O -pipe -Wall -Wno-non-virtual-dtor -c -o dessp.o dessp.cpp
g++ -DHAVE_CONFIG_H -I.. -I../.. -O -pipe -Wall -Wno-non-virtual-dtor -c -o elgamal.o elgamal.cpp
g++ -DHAVE_CONFIG_H -I.. -I../.. -O -pipe -Wall -Wno-non-virtual-dtor -c -o eprecomp.o eprecomp.cpp
g++ -DHAVE_CONFIG_H -I.. -I../.. -O -pipe -Wall -Wno-non-virtual-dtor -c -o filters.o filters.cpp
g++ -DHAVE_CONFIG_H -I.. -I../.. -O -pipe -Wall -Wno-non-virtual-dtor -c -o forkjoin.o forkjoin.cpp
g++ -DHAVE_CONFIG_H -I.. -I../.. -O -pipe -Wall -Wno-non-virtual-dtor -c -o integer.o integer.cpp
integer.cpp: In function `void MontgomeryReduce(word*, word*, const word*,
const word*, const word*, unsigned int)':
integer.cpp:714: warning: unused variable `word carry'
integer.cpp: In function `void CorrectQuotientEstimate(word*, word*, word&,
word&, const word*, unsigned int)':
integer.cpp:874: warning: unused variable `word borrow'
integer.cpp: In member function `Integer& Integer::operator++()':
integer.cpp:1588: warning: unused variable `word borrow'
g++ -DHAVE_CONFIG_H -I.. -I../.. -O -pipe -Wall -Wno-non-virtual-dtor -c -o iterhash.o iterhash.cpp
g++ -DHAVE_CONFIG_H -I.. -I../.. -O -pipe -Wall -Wno-non-virtual-dtor -c -o misc.o misc.cpp
g++ -DHAVE_CONFIG_H -I.. -I../.. -O -pipe -Wall -Wno-non-virtual-dtor -c -o nbtheory.o nbtheory.cpp
g++ -DHAVE_CONFIG_H -I.. -I../.. -O -pipe -Wall -Wno-non-virtual-dtor -c -o pch.o pch.cpp
g++ -DHAVE_CONFIG_H -I.. -I../.. -O -pipe -Wall -Wno-non-virtual-dtor -c -o queue.o queue.cpp
g++ -DHAVE_CONFIG_H -I.. -I../.. -O -pipe -Wall -Wno-non-virtual-dtor -c -o rng.o rng.cpp
g++ -DHAVE_CONFIG_H -I.. -I../.. -O -pipe -Wall -Wno-non-virtual-dtor -c -o sha.o sha.cpp
g++ -DHAVE_CONFIG_H -I.. -I../.. -O -pipe -Wall -Wno-non-virtual-dtor -c -o zbits.o zbits.cpp
g++ -DHAVE_CONFIG_H -I.. -I../.. -O -pipe -Wall -Wno-non-virtual-dtor -c -o zdeflate.o zdeflate.cpp
g++ -DHAVE_CONFIG_H -I.. -I../.. -O -pipe -Wall -Wno-non-virtual-dtor -c -o zinflate.o zinflate.cpp
g++ -DHAVE_CONFIG_H -I.. -I../.. -O -pipe -Wall -Wno-non-virtual-dtor -c -o ztrees.o ztrees.cpp
rm -f libcryptlib.a
ar cru libcryptlib.a algebra.o asn.o cryptlib.o des.o dessp.o elgamal.o eprecomp.o filters.o forkjoin.o integer.o iterhash.o misc.o nbtheory.o pch.o queue.o rng.o sha.o zbits.o zdeflate.o zinflate.o ztrees.o
ranlib libcryptlib.a
ln -f libcryptlib.a ../../lib/libcryptlib.a
make[3]: Leaving directory `/tmp/ats_security/tripwire-2.4.2.1/src/cryptlib'
Making all in core
make[3]: Entering directory `/tmp/ats_security/tripwire-2.4.2.1/src/core'
g++ -DHAVE_CONFIG_H -I. -I. -I../.. -I.. -O -pipe -Wall -Wno-non-virtual-dtor -c -o file_unix.o file_unix.cpp
file_unix.cpp:58: warning: `TSTRING util_GetErrnoString()' defined but not used
g++ -DHAVE_CONFIG_H -I. -I. -I../.. -I.. -O -pipe -Wall -Wno-non-virtual-dtor -c -o unixfsservices.o unixfsservices.cpp
g++ -DHAVE_CONFIG_H -I. -I. -I../.. -I.. -O -pipe -Wall -Wno-non-virtual-dtor -c -o charutil_t.o charutil_t.cpp
g++ -DHAVE_CONFIG_H -I. -I. -I../.. -I.. -O -pipe -Wall -Wno-non-virtual-dtor -c -o displayencoder_t.o displayencoder_t.cpp
g++ -DHAVE_CONFIG_H -I. -I. -I../.. -I.. -O -pipe -Wall -Wno-non-virtual-dtor -c -o archive.o archive.cpp
g++ -DHAVE_CONFIG_H -I. -I. -I../.. -I.. -O -pipe -Wall -Wno-non-virtual-dtor -c -o charutil.o charutil.cpp
g++ -DHAVE_CONFIG_H -I. -I. -I../.. -I.. -O -pipe -Wall -Wno-non-virtual-dtor -c -o cmdlineparser.o cmdlineparser.cpp
g++ -DHAVE_CONFIG_H -I. -I. -I../.. -I.. -O -pipe -Wall -Wno-non-virtual-dtor -c -o codeconvert.o codeconvert.cpp
g++ -DHAVE_CONFIG_H -I. -I. -I../.. -I.. -O -pipe -Wall -Wno-non-virtual-dtor -c -o core.o core.cpp
core.cpp: In member function `cCore::cCore()':
core.cpp:49: warning: unused variable `RegisterErrorscore registercore'
g++ -DHAVE_CONFIG_H -I. -I. -I../.. -I.. -O -pipe -Wall -Wno-non-virtual-dtor -c -o coreerrors.o coreerrors.cpp
g++ -DHAVE_CONFIG_H -I. -I. -I../.. -I.. -O -pipe -Wall -Wno-non-virtual-dtor -c -o corestrings.o corestrings.cpp
g++ -DHAVE_CONFIG_H -I. -I. -I../.. -I.. -O -pipe -Wall -Wno-non-virtual-dtor -c -o crc32.o crc32.cpp
g++ -DHAVE_CONFIG_H -I. -I. -I../.. -I.. -O -pipe -Wall -Wno-non-virtual-dtor -c -o debug.o debug.cpp
g++ -DHAVE_CONFIG_H -I. -I. -I../.. -I.. -O -pipe -Wall -Wno-non-virtual-dtor -c -o displayencoder.o displayencoder.cpp
g++ -DHAVE_CONFIG_H -I. -I. -I../.. -I.. -O -pipe -Wall -Wno-non-virtual-dtor -c -o displayutil.o displayutil.cpp
g++ -DHAVE_CONFIG_H -I. -I. -I../.. -I.. -O -pipe -Wall -Wno-non-virtual-dtor -c -o error.o error.cpp
g++ -DHAVE_CONFIG_H -I. -I. -I../.. -I.. -O -pipe -Wall -Wno-non-virtual-dtor -c -o errorbucketimpl.o errorbucketimpl.cpp
g++ -DHAVE_CONFIG_H -I. -I. -I../.. -I.. -O -pipe -Wall -Wno-non-virtual-dtor -c -o errortable.o errortable.cpp
g++ -DHAVE_CONFIG_H -I. -I. -I../.. -I.. -O -pipe -Wall -Wno-non-virtual-dtor -c -o errorutil.o errorutil.cpp
g++ -DHAVE_CONFIG_H -I. -I. -I../.. -I.. -O -pipe -Wall -Wno-non-virtual-dtor -c -o fileerror.o fileerror.cpp
g++ -DHAVE_CONFIG_H -I. -I. -I../.. -I.. -O -pipe -Wall -Wno-non-virtual-dtor -c -o fileheader.o fileheader.cpp
g++ -DHAVE_CONFIG_H -I. -I. -I../.. -I.. -O -pipe -Wall -Wno-non-virtual-dtor -c -o fsservices.o fsservices.cpp
g++ -DHAVE_CONFIG_H -I. -I. -I../.. -I.. -O -pipe -Wall -Wno-non-virtual-dtor -c -o growheap.o growheap.cpp
g++ -DHAVE_CONFIG_H -I. -I. -I../.. -I.. -O -pipe -Wall -Wno-non-virtual-dtor -c -o hashtable.o hashtable.cpp
g++ -DHAVE_CONFIG_H -I. -I. -I../.. -I.. -O -pipe -Wall -Wno-non-virtual-dtor -c -o haval.o haval.cpp
g++ -DHAVE_CONFIG_H -I. -I. -I../.. -I.. -O -pipe -Wall -Wno-non-virtual-dtor -c -o msystem.o msystem.cpp
g++ -DHAVE_CONFIG_H -I. -I. -I../.. -I.. -O -pipe -Wall -Wno-non-virtual-dtor -c -o ntmbs.o ntmbs.cpp
ntmbs.cpp: In function `char* tss::mbsdec(const char*, const char*)':
ntmbs.cpp:99: warning: comparison between signed and unsigned integer
expressions
g++ -DHAVE_CONFIG_H -I. -I. -I../.. -I.. -O -pipe -Wall -Wno-non-virtual-dtor -c -o objectpool.o objectpool.cpp
g++ -DHAVE_CONFIG_H -I. -I. -I../.. -I.. -O -pipe -Wall -Wno-non-virtual-dtor -c -o refcountobj.o refcountobj.cpp
g++ -DHAVE_CONFIG_H -I. -I. -I../.. -I.. -O -pipe -Wall -Wno-non-virtual-dtor -c -o serializable.o serializable.cpp
g++ -DHAVE_CONFIG_H -I. -I. -I../.. -I.. -O -pipe -Wall -Wno-non-virtual-dtor -c -o serializer.o serializer.cpp
g++ -DHAVE_CONFIG_H -I. -I. -I../.. -I.. -O -pipe -Wall -Wno-non-virtual-dtor -c -o serializerimpl.o serializerimpl.cpp
g++ -DHAVE_CONFIG_H -I. -I. -I../.. -I.. -O -pipe -Wall -Wno-non-virtual-dtor -c -o serializerutil.o serializerutil.cpp
g++ -DHAVE_CONFIG_H -I. -I. -I../.. -I.. -O -pipe -Wall -Wno-non-virtual-dtor -c -o serstring.o serstring.cpp
g++ -DHAVE_CONFIG_H -I. -I. -I../.. -I.. -O -pipe -Wall -Wno-non-virtual-dtor -c -o srefcountobj.o srefcountobj.cpp
g++ -DHAVE_CONFIG_H -I. -I. -I../.. -I.. -O -pipe -Wall -Wno-non-virtual-dtor -c -o srefcounttbl.o srefcounttbl.cpp
g++ -DHAVE_CONFIG_H -I. -I. -I../.. -I.. -O -pipe -Wall -Wno-non-virtual-dtor -c -o stdcore.o stdcore.cpp
g++ -DHAVE_CONFIG_H -I. -I. -I../.. -I.. -O -pipe -Wall -Wno-non-virtual-dtor -c -o stringutil.o stringutil.cpp
g++ -DHAVE_CONFIG_H -I. -I. -I../.. -I.. -O -pipe -Wall -Wno-non-virtual-dtor -c -o timebomb.o timebomb.cpp
g++ -DHAVE_CONFIG_H -I. -I. -I../.. -I.. -O -pipe -Wall -Wno-non-virtual-dtor -c -o timeconvert.o timeconvert.cpp
g++ -DHAVE_CONFIG_H -I. -I. -I../.. -I.. -O -pipe -Wall -Wno-non-virtual-dtor -c -o tw_signal.o tw_signal.cpp
g++ -DHAVE_CONFIG_H -I. -I. -I../.. -I.. -O -pipe -Wall -Wno-non-virtual-dtor -c -o twlimits.o twlimits.cpp
g++ -DHAVE_CONFIG_H -I. -I. -I../.. -I.. -O -pipe -Wall -Wno-non-virtual-dtor -c -o twlocale.o twlocale.cpp
twlocale.cpp: In function `TSTRING& util_FormatTimeC(tm*, TSTRING&)':
twlocale.cpp:316: warning: `%c' yields only last 2 digits of year in some
locales
/usr/lib/gcc-lib/i686-pc-linux-gnu/3.2.3/include/g++-v3/bits/stl_map.h: At top
level:
twlocale.cpp:283: warning: `TSTRING& util_FormatTimeCPlusPlus(tm*, TSTRING&)'
defined but not used
g++ -DHAVE_CONFIG_H -I. -I. -I../.. -I.. -O -pipe -Wall -Wno-non-virtual-dtor -c -o unixexcept.o unixexcept.cpp
g++ -DHAVE_CONFIG_H -I. -I. -I../.. -I.. -O -pipe -Wall -Wno-non-virtual-dtor -c -o usernotify.o usernotify.cpp
g++ -DHAVE_CONFIG_H -I. -I. -I../.. -I.. -O -pipe -Wall -Wno-non-virtual-dtor -c -o usernotifystdout.o usernotifystdout.cpp
g++ -DHAVE_CONFIG_H -I. -I. -I../.. -I.. -O -pipe -Wall -Wno-non-virtual-dtor -c -o utf8.o utf8.cpp
g++ -DHAVE_CONFIG_H -I. -I. -I../.. -I.. -O -pipe -Wall -Wno-non-virtual-dtor -c -o wchar16.o wchar16.cpp
rm -f libcore.a
ar cru libcore.a file_unix.o unixfsservices.o charutil_t.o displayencoder_t.o archive.o charutil.o cmdlineparser.o codeconvert.o core.o coreerrors.o corestrings.o crc32.o debug.o displayencoder.o displayutil.o error.o errorbucketimpl.o errortable.o errorutil.o fileerror.o fileheader.o fsservices.o growheap.o hashtable.o haval.o msystem.o ntmbs.o objectpool.o refcountobj.o serializable.o serializer.o serializerimpl.o serializerutil.o serstring.o srefcountobj.o srefcounttbl.o stdcore.o stringutil.o timebomb.o timeconvert.o tw_signal.o twlimits.o twlocale.o unixexcept.o usernotify.o usernotifystdout.o utf8.o wchar16.o
ranlib libcore.a
ar ru ../../lib/libtripwire.a file_unix.o unixfsservices.o charutil_t.o displayencoder_t.o archive.o charutil.o cmdlineparser.o codeconvert.o core.o coreerrors.o corestrings.o crc32.o debug.o displayencoder.o displayutil.o error.o errorbucketimpl.o errortable.o errorutil.o fileerror.o fileheader.o fsservices.o growheap.o hashtable.o haval.o msystem.o ntmbs.o objectpool.o refcountobj.o serializable.o serializer.o serializerimpl.o serializerutil.o serstring.o srefcountobj.o srefcounttbl.o stdcore.o stringutil.o timebomb.o timeconvert.o tw_signal.o twlimits.o twlocale.o unixexcept.o usernotify.o usernotifystdout.o utf8.o wchar16.o
make[3]: Leaving directory `/tmp/ats_security/tripwire-2.4.2.1/src/core'
Making all in db
make[3]: Entering directory `/tmp/ats_security/tripwire-2.4.2.1/src/db'
g++ -DHAVE_CONFIG_H -I. -I. -I../.. -I.. -O -pipe -Wall -Wno-non-virtual-dtor -c -o blockfile.o blockfile.cpp
g++ -DHAVE_CONFIG_H -I. -I. -I../.. -I.. -O -pipe -Wall -Wno-non-virtual-dtor -c -o blockrecordarray.o blockrecordarray.cpp
g++ -DHAVE_CONFIG_H -I. -I. -I../.. -I.. -O -pipe -Wall -Wno-non-virtual-dtor -c -o blockrecordfile.o blockrecordfile.cpp
g++ -DHAVE_CONFIG_H -I. -I. -I../.. -I.. -O -pipe -Wall -Wno-non-virtual-dtor -c -o db.o db.cpp
g++ -DHAVE_CONFIG_H -I. -I. -I../.. -I.. -O -pipe -Wall -Wno-non-virtual-dtor -c -o hierdatabase.o hierdatabase.cpp
g++ -DHAVE_CONFIG_H -I. -I. -I../.. -I.. -O -pipe -Wall -Wno-non-virtual-dtor -c -o hierdbpath.o hierdbpath.cpp
g++ -DHAVE_CONFIG_H -I. -I. -I../.. -I.. -O -pipe -Wall -Wno-non-virtual-dtor -c -o stddb.o stddb.cpp
rm -f libdb.a
ar cru libdb.a blockfile.o blockrecordarray.o blockrecordfile.o db.o hierdatabase.o hierdbpath.o stddb.o
ranlib libdb.a
ar ru ../../lib/libtripwire.a blockfile.o blockrecordarray.o blockrecordfile.o db.o hierdatabase.o hierdbpath.o stddb.o
make[3]: Leaving directory `/tmp/ats_security/tripwire-2.4.2.1/src/db'
Making all in fco
make[3]: Entering directory `/tmp/ats_security/tripwire-2.4.2.1/src/fco'
g++ -DHAVE_CONFIG_H -I. -I. -I../.. -I.. -O -pipe -Wall -Wno-non-virtual-dtor -c -o fco.o fco.cpp
fco.cpp: In member function `cFCO::cFCO()':
fco.cpp:50: warning: unused variable `RegisterErrorsfco registerfco'
g++ -DHAVE_CONFIG_H -I. -I. -I../.. -I.. -O -pipe -Wall -Wno-non-virtual-dtor -c -o fcocompare.o fcocompare.cpp
g++ -DHAVE_CONFIG_H -I. -I. -I../.. -I.. -O -pipe -Wall -Wno-non-virtual-dtor -c -o fcodatasourceiter.o fcodatasourceiter.cpp
g++ -DHAVE_CONFIG_H -I. -I. -I../.. -I.. -O -pipe -Wall -Wno-non-virtual-dtor -c -o fcodatasourceiterimpl.o fcodatasourceiterimpl.cpp
g++ -DHAVE_CONFIG_H -I. -I. -I../.. -I.. -O -pipe -Wall -Wno-non-virtual-dtor -c -o fcoerrors.o fcoerrors.cpp
g++ -DHAVE_CONFIG_H -I. -I. -I../.. -I.. -O -pipe -Wall -Wno-non-virtual-dtor -c -o fconame.o fconame.cpp
g++ -DHAVE_CONFIG_H -I. -I. -I../.. -I.. -O -pipe -Wall -Wno-non-virtual-dtor -c -o fconametbl.o fconametbl.cpp
g++ -DHAVE_CONFIG_H -I. -I. -I../.. -I.. -O -pipe -Wall -Wno-non-virtual-dtor -c -o fcopropimpl.o fcopropimpl.cpp
g++ -DHAVE_CONFIG_H -I. -I. -I../.. -I.. -O -pipe -Wall -Wno-non-virtual-dtor -c -o fcopropvector.o fcopropvector.cpp
g++ -DHAVE_CONFIG_H -I. -I. -I../.. -I.. -O -pipe -Wall -Wno-non-virtual-dtor -c -o fcosetimpl.o fcosetimpl.cpp
g++ -DHAVE_CONFIG_H -I. -I. -I../.. -I.. -O -pipe -Wall -Wno-non-virtual-dtor -c -o fcospec.o fcospec.cpp
g++ -DHAVE_CONFIG_H -I. -I. -I../.. -I.. -O -pipe -Wall -Wno-non-virtual-dtor -c -o fcospecattr.o fcospecattr.cpp
g++ -DHAVE_CONFIG_H -I. -I. -I../.. -I.. -O -pipe -Wall -Wno-non-virtual-dtor -c -o fcospechelper.o fcospechelper.cpp
g++ -DHAVE_CONFIG_H -I. -I. -I../.. -I.. -O -pipe -Wall -Wno-non-virtual-dtor -c -o fcospecimpl.o fcospecimpl.cpp
g++ -DHAVE_CONFIG_H -I. -I. -I../.. -I.. -O -pipe -Wall -Wno-non-virtual-dtor -c -o fcospeclist.o fcospeclist.cpp
g++ -DHAVE_CONFIG_H -I. -I. -I../.. -I.. -O -pipe -Wall -Wno-non-virtual-dtor -c -o fcospecutil.o fcospecutil.cpp
g++ -DHAVE_CONFIG_H -I. -I. -I../.. -I.. -O -pipe -Wall -Wno-non-virtual-dtor -c -o fcostrings.o fcostrings.cpp
g++ -DHAVE_CONFIG_H -I. -I. -I../.. -I.. -O -pipe -Wall -Wno-non-virtual-dtor -c -o fcoundefprop.o fcoundefprop.cpp
g++ -DHAVE_CONFIG_H -I. -I. -I../.. -I.. -O -pipe -Wall -Wno-non-virtual-dtor -c -o genreinfo.o genreinfo.cpp
g++ -DHAVE_CONFIG_H -I. -I. -I../.. -I.. -O -pipe -Wall -Wno-non-virtual-dtor -c -o genrespeclist.o genrespeclist.cpp
g++ -DHAVE_CONFIG_H -I. -I. -I../.. -I.. -O -pipe -Wall -Wno-non-virtual-dtor -c -o genreswitcher.o genreswitcher.cpp
g++ -DHAVE_CONFIG_H -I. -I. -I../.. -I.. -O -pipe -Wall -Wno-non-virtual-dtor -c -o signature.o signature.cpp
signature.cpp: In member function `virtual TSTRING cMD5Signature::AsStringHex()
const':
signature.cpp:538: warning: long unsigned int format, int arg (arg 3)
g++ -DHAVE_CONFIG_H -I. -I. -I../.. -I.. -O -pipe -Wall -Wno-non-virtual-dtor -c -o stdfco.o stdfco.cpp
g++ -DHAVE_CONFIG_H -I. -I. -I../.. -I.. -O -pipe -Wall -Wno-non-virtual-dtor -c -o twfactory.o twfactory.cpp
rm -f libfco.a
ar cru libfco.a fco.o fcocompare.o fcodatasourceiter.o fcodatasourceiterimpl.o fcoerrors.o fconame.o fconametbl.o fcopropimpl.o fcopropvector.o fcosetimpl.o fcospec.o fcospecattr.o fcospechelper.o fcospecimpl.o fcospeclist.o fcospecutil.o fcostrings.o fcoundefprop.o genreinfo.o genrespeclist.o genreswitcher.o signature.o stdfco.o twfactory.o
ranlib libfco.a
ar ru ../../lib/libtripwire.a fco.o fcocompare.o fcodatasourceiter.o fcodatasourceiterimpl.o fcoerrors.o fconame.o fconametbl.o fcopropimpl.o fcopropvector.o fcosetimpl.o fcospec.o fcospecattr.o fcospechelper.o fcospecimpl.o fcospeclist.o fcospecutil.o fcostrings.o fcoundefprop.o genreinfo.o genrespeclist.o genreswitcher.o signature.o stdfco.o twfactory.o
make[3]: Leaving directory `/tmp/ats_security/tripwire-2.4.2.1/src/fco'
Making all in fs
make[3]: Entering directory `/tmp/ats_security/tripwire-2.4.2.1/src/fs'
g++ -DHAVE_CONFIG_H -I. -I. -I../.. -I.. -O -pipe -Wall -Wno-non-virtual-dtor -c -o fs.o fs.cpp
fs.cpp: In member function `cFS::cFS()':
fs.cpp:87: warning: unused variable `RegisterErrorsfs registerfs'
g++ -DHAVE_CONFIG_H -I. -I. -I../.. -I.. -O -pipe -Wall -Wno-non-virtual-dtor -c -o fsdatasourceiter.o fsdatasourceiter.cpp
g++ -DHAVE_CONFIG_H -I. -I. -I../.. -I.. -O -pipe -Wall -Wno-non-virtual-dtor -c -o fserrors.o fserrors.cpp
g++ -DHAVE_CONFIG_H -I. -I. -I../.. -I.. -O -pipe -Wall -Wno-non-virtual-dtor -c -o fsfactory.o fsfactory.cpp
g++ -DHAVE_CONFIG_H -I. -I. -I../.. -I.. -O -pipe -Wall -Wno-non-virtual-dtor -c -o fsnametranslator.o fsnametranslator.cpp
g++ -DHAVE_CONFIG_H -I. -I. -I../.. -I.. -O -pipe -Wall -Wno-non-virtual-dtor -c -o fsobject.o fsobject.cpp
g++ -DHAVE_CONFIG_H -I. -I. -I../.. -I.. -O -pipe -Wall -Wno-non-virtual-dtor -c -o fsparserutil.o fsparserutil.cpp
g++ -DHAVE_CONFIG_H -I. -I. -I../.. -I.. -O -pipe -Wall -Wno-non-virtual-dtor -c -o fspropcalc.o fspropcalc.cpp
g++ -DHAVE_CONFIG_H -I. -I. -I../.. -I.. -O -pipe -Wall -Wno-non-virtual-dtor -c -o fspropdisplayer.o fspropdisplayer.cpp
g++ -DHAVE_CONFIG_H -I. -I. -I../.. -I.. -O -pipe -Wall -Wno-non-virtual-dtor -c -o fspropset.o fspropset.cpp
g++ -DHAVE_CONFIG_H -I. -I. -I../.. -I.. -O -pipe -Wall -Wno-non-virtual-dtor -c -o fsstrings.o fsstrings.cpp
g++ -DHAVE_CONFIG_H -I. -I. -I../.. -I.. -O -pipe -Wall -Wno-non-virtual-dtor -c -o fsvisitor.o fsvisitor.cpp
g++ -DHAVE_CONFIG_H -I. -I. -I../.. -I.. -O -pipe -Wall -Wno-non-virtual-dtor -c -o stdfs.o stdfs.cpp
rm -f libfs.a
ar cru libfs.a fs.o fsdatasourceiter.o fserrors.o fsfactory.o fsnametranslator.o fsobject.o fsparserutil.o fspropcalc.o fspropdisplayer.o fspropset.o fsstrings.o fsvisitor.o stdfs.o
ranlib libfs.a
ar ru ../../lib/libtripwire.a fs.o fsdatasourceiter.o fserrors.o fsfactory.o fsnametranslator.o fsobject.o fsparserutil.o fspropcalc.o fspropdisplayer.o fspropset.o fsstrings.o fsvisitor.o stdfs.o
make[3]: Leaving directory `/tmp/ats_security/tripwire-2.4.2.1/src/fs'
Making all in tw
make[3]: Entering directory `/tmp/ats_security/tripwire-2.4.2.1/src/tw'
g++ -DHAVE_CONFIG_H -DCONFIG_DIR=\"/etc/tripwire\" -I. -I. -I../.. -I.. -O -pipe -Wall -Wno-non-virtual-dtor -c -o configfile.o configfile.cpp
configfile.cpp:78: warning: `void GetKeyValuePair(const TSTRING&, TSTRING&,
TSTRING&)' declared `static' but never defined
g++ -DHAVE_CONFIG_H -DCONFIG_DIR=\"/etc/tripwire\" -I. -I. -I../.. -I.. -O -pipe -Wall -Wno-non-virtual-dtor -c -o dbdatasource.o dbdatasource.cpp
g++ -DHAVE_CONFIG_H -DCONFIG_DIR=\"/etc/tripwire\" -I. -I. -I../.. -I.. -O -pipe -Wall -Wno-non-virtual-dtor -c -o dbdebug.o dbdebug.cpp
dbdebug.cpp:70: warning: `void util_PrintFCO(const iFCO*, iFCOPropDisplayer*)'
declared `static' but never defined
dbdebug.cpp:72: warning: `void util_MapHierRoot(std::map<std::pair<int, int>,
int, std::less<std::pair<int, int> >, std::allocator<std::pair<const
std::pair<int, int>, int> > >)' declared `static' but never defined
g++ -DHAVE_CONFIG_H -DCONFIG_DIR=\"/etc/tripwire\" -I. -I. -I../.. -I.. -O -pipe -Wall -Wno-non-virtual-dtor -c -o dbexplore.o dbexplore.cpp
g++ -DHAVE_CONFIG_H -DCONFIG_DIR=\"/etc/tripwire\" -I. -I. -I../.. -I.. -O -pipe -Wall -Wno-non-virtual-dtor -c -o fcodatabasefile.o fcodatabasefile.cpp
g++ -DHAVE_CONFIG_H -DCONFIG_DIR=\"/etc/tripwire\" -I. -I. -I../.. -I.. -O -pipe -Wall -Wno-non-virtual-dtor -c -o fcodatabaseutil.o fcodatabaseutil.cpp
g++ -DHAVE_CONFIG_H -DCONFIG_DIR=\"/etc/tripwire\" -I. -I. -I../.. -I.. -O -pipe -Wall -Wno-non-virtual-dtor -c -o fcoreport.o fcoreport.cpp
g++ -DHAVE_CONFIG_H -DCONFIG_DIR=\"/etc/tripwire\" -I. -I. -I../.. -I.. -O -pipe -Wall -Wno-non-virtual-dtor -c -o fcoreportutil.o fcoreportutil.cpp
g++ -DHAVE_CONFIG_H -DCONFIG_DIR=\"/etc/tripwire\" -I. -I. -I../.. -I.. -O -pipe -Wall -Wno-non-virtual-dtor -c -o filemanipulator.o filemanipulator.cpp
g++ -DHAVE_CONFIG_H -DCONFIG_DIR=\"/etc/tripwire\" -I. -I. -I../.. -I.. -O -pipe -Wall -Wno-non-virtual-dtor -c -o headerinfo.o headerinfo.cpp
g++ -DHAVE_CONFIG_H -DCONFIG_DIR=\"/etc/tripwire\" -I. -I. -I../.. -I.. -O -pipe -Wall -Wno-non-virtual-dtor -c -o policyfile.o policyfile.cpp
g++ -DHAVE_CONFIG_H -DCONFIG_DIR=\"/etc/tripwire\" -I. -I. -I../.. -I.. -O -pipe -Wall -Wno-non-virtual-dtor -c -o stdtw.o stdtw.cpp
g++ -DHAVE_CONFIG_H -DCONFIG_DIR=\"/etc/tripwire\" -I. -I. -I../.. -I.. -O -pipe -Wall -Wno-non-virtual-dtor -c -o systeminfo.o systeminfo.cpp
g++ -DHAVE_CONFIG_H -DCONFIG_DIR=\"/etc/tripwire\" -I. -I. -I../.. -I.. -O -pipe -Wall -Wno-non-virtual-dtor -c -o textdbviewer.o textdbviewer.cpp
g++ -DHAVE_CONFIG_H -DCONFIG_DIR=\"/etc/tripwire\" -I. -I. -I../.. -I.. -O -pipe -Wall -Wno-non-virtual-dtor -c -o textreportviewer.o textreportviewer.cpp
g++ -DHAVE_CONFIG_H -DCONFIG_DIR=\"/etc/tripwire\" -I. -I. -I../.. -I.. -O -pipe -Wall -Wno-non-virtual-dtor -c -o tw.o tw.cpp
tw.cpp: In member function `cTW::cTW()':
tw.cpp:66: warning: unused variable `RegisterErrorstw registertw'
g++ -DHAVE_CONFIG_H -DCONFIG_DIR=\"/etc/tripwire\" -I. -I. -I../.. -I.. -O -pipe -Wall -Wno-non-virtual-dtor -c -o twerrors.o twerrors.cpp
g++ -DHAVE_CONFIG_H -DCONFIG_DIR=\"/etc/tripwire\" -I. -I. -I../.. -I.. -O -pipe -Wall -Wno-non-virtual-dtor -c -o twinit.o twinit.cpp
g++ -DHAVE_CONFIG_H -DCONFIG_DIR=\"/etc/tripwire\" -I. -I. -I../.. -I.. -O -pipe -Wall -Wno-non-virtual-dtor -c -o twstrings.o twstrings.cpp
g++ -DHAVE_CONFIG_H -DCONFIG_DIR=\"/etc/tripwire\" -I. -I. -I../.. -I.. -O -pipe -Wall -Wno-non-virtual-dtor -c -o twutil.o twutil.cpp
rm -f libtw.a
ar cru libtw.a configfile.o dbdatasource.o dbdebug.o dbexplore.o fcodatabasefile.o fcodatabaseutil.o fcoreport.o fcoreportutil.o filemanipulator.o headerinfo.o policyfile.o stdtw.o systeminfo.o textdbviewer.o textreportviewer.o tw.o twerrors.o twinit.o twstrings.o twutil.o
ranlib libtw.a
ar ru ../../lib/libtripwire.a configfile.o dbdatasource.o dbdebug.o dbexplore.o fcodatabasefile.o fcodatabaseutil.o fcoreport.o fcoreportutil.o filemanipulator.o headerinfo.o policyfile.o stdtw.o systeminfo.o textdbviewer.o textreportviewer.o tw.o twerrors.o twinit.o twstrings.o twutil.o
make[3]: Leaving directory `/tmp/ats_security/tripwire-2.4.2.1/src/tw'
Making all in twcrypto
make[3]: Entering directory `/tmp/ats_security/tripwire-2.4.2.1/src/twcrypto'
g++ -DHAVE_CONFIG_H -I. -I. -I../.. -I.. -O -pipe -Wall -Wno-non-virtual-dtor -c -o bytequeue.o bytequeue.cpp
g++ -DHAVE_CONFIG_H -I. -I. -I../.. -I.. -O -pipe -Wall -Wno-non-virtual-dtor -c -o crypto.o crypto.cpp
g++ -DHAVE_CONFIG_H -I. -I. -I../.. -I.. -O -pipe -Wall -Wno-non-virtual-dtor -c -o cryptoarchive.o cryptoarchive.cpp
g++ -DHAVE_CONFIG_H -I. -I. -I../.. -I.. -O -pipe -Wall -Wno-non-virtual-dtor -c -o keyfile.o keyfile.cpp
g++ -DHAVE_CONFIG_H -I. -I. -I../.. -I.. -O -pipe -Wall -Wno-non-virtual-dtor -c -o stdtwcrypto.o stdtwcrypto.cpp
g++ -DHAVE_CONFIG_H -I. -I. -I../.. -I.. -O -pipe -Wall -Wno-non-virtual-dtor -c -o twcrypto.o twcrypto.cpp
twcrypto.cpp: In member function `cTWCrypto::cTWCrypto()':
twcrypto.cpp:63: warning: unused variable `RegisterErrorstwcrypto
registertwcrypto'
g++ -DHAVE_CONFIG_H -I. -I. -I../.. -I.. -O -pipe -Wall -Wno-non-virtual-dtor -c -o twcryptoerrors.o twcryptoerrors.cpp
rm -f libtwcrypto.a
ar cru libtwcrypto.a bytequeue.o crypto.o cryptoarchive.o keyfile.o stdtwcrypto.o twcrypto.o twcryptoerrors.o
ranlib libtwcrypto.a
ar ru ../../lib/libtripwire.a bytequeue.o crypto.o cryptoarchive.o keyfile.o stdtwcrypto.o twcrypto.o twcryptoerrors.o
make[3]: Leaving directory `/tmp/ats_security/tripwire-2.4.2.1/src/twcrypto'
Making all in twparser
make[3]: Entering directory `/tmp/ats_security/tripwire-2.4.2.1/src/twparser'
g++ -DHAVE_CONFIG_H -I. -I. -I../.. -I.. -O -pipe -Wall -Wno-non-virtual-dtor -c -o genreparseinfo.o genreparseinfo.cpp
g++ -DHAVE_CONFIG_H -I. -I. -I../.. -I.. -O -pipe -Wall -Wno-non-virtual-dtor -c -o parserhelper.o parserhelper.cpp
g++ -DHAVE_CONFIG_H -I. -I. -I../.. -I.. -O -pipe -Wall -Wno-non-virtual-dtor -c -o parserobjects.o parserobjects.cpp
g++ -DHAVE_CONFIG_H -I. -I. -I../.. -I.. -O -pipe -Wall -Wno-non-virtual-dtor -c -o policyparser.o policyparser.cpp
policyparser.cpp:61: warning: `bool
util_ReadMBCharAsSBString(std::stringstream&, std::string&)' declared
`static' but never defined
policyparser.cpp:63: warning: `std::string util_Output512Chars(const
std::string&)' declared `static' but never defined
g++ -DHAVE_CONFIG_H -I. -I. -I../.. -I.. -O -pipe -Wall -Wno-non-virtual-dtor -c -o stdtwparser.o stdtwparser.cpp
g++ -DHAVE_CONFIG_H -I. -I. -I../.. -I.. -O -pipe -Wall -Wno-non-virtual-dtor -c -o twparser.o twparser.cpp
twparser.cpp: In member function `cTWParser::cTWParser()':
twparser.cpp:57: warning: unused variable `RegisterErrorstwparser
registertwparser'
g++ -DHAVE_CONFIG_H -I. -I. -I../.. -I.. -O -pipe -Wall -Wno-non-virtual-dtor -c -o twparsererrors.o twparsererrors.cpp
g++ -DHAVE_CONFIG_H -I. -I. -I../.. -I.. -O -pipe -Wall -Wno-non-virtual-dtor -c -o twparserstrings.o twparserstrings.cpp
g++ -DHAVE_CONFIG_H -I. -I. -I../.. -I.. -O -pipe -Wall -Wno-non-virtual-dtor -c -o yylex.o yylex.cpp
..\..\mkslexyacc\etc\yylex.cpp: In member function `int yy_scan::yylex()':
..\..\mkslexyacc\etc\yylex.cpp:501: warning: label `yy_more' defined but not
used
..\..\mkslexyacc\etc\yylex.cpp:493: warning: label `yy_reject' defined but not
used
g++ -DHAVE_CONFIG_H -I. -I. -I../.. -I.. -O -pipe -Wall -Wno-non-virtual-dtor -c -o yyparse.o yyparse.cpp
..\..\mkslexyacc\etc\yyparse.cpp: In member function `int
yy_parse::yyparse(yy_scan*)':
..\..\mkslexyacc\etc\yyparse.cpp:365: warning: label `yyerrlabel' defined but
not used
rm -f libtwparser.a
ar cru libtwparser.a genreparseinfo.o parserhelper.o parserobjects.o policyparser.o stdtwparser.o twparser.o twparsererrors.o twparserstrings.o yylex.o yyparse.o
ranlib libtwparser.a
ar ru ../../lib/libtripwire.a genreparseinfo.o parserhelper.o parserobjects.o policyparser.o stdtwparser.o twparser.o twparsererrors.o twparserstrings.o yylex.o yyparse.o
make[3]: Leaving directory `/tmp/ats_security/tripwire-2.4.2.1/src/twparser'
Making all in util
make[3]: Entering directory `/tmp/ats_security/tripwire-2.4.2.1/src/util'
g++ -DHAVE_CONFIG_H -I. -I. -I../.. -I.. -O -pipe -Wall -Wno-non-virtual-dtor -c -o fileutil.o fileutil.cpp
g++ -DHAVE_CONFIG_H -I. -I. -I../.. -I.. -O -pipe -Wall -Wno-non-virtual-dtor -c -o stdutil.o stdutil.cpp
g++ -DHAVE_CONFIG_H -I. -I. -I../.. -I.. -O -pipe -Wall -Wno-non-virtual-dtor -c -o stringencoder.o stringencoder.cpp
g++ -DHAVE_CONFIG_H -I. -I. -I../.. -I.. -O -pipe -Wall -Wno-non-virtual-dtor -c -o util.o util.cpp
util.cpp: In member function `cUtil::cUtil()':
util.cpp:47: warning: unused variable `RegisterErrorsutil registerutil'
g++ -DHAVE_CONFIG_H -I. -I. -I../.. -I.. -O -pipe -Wall -Wno-non-virtual-dtor -c -o utilerrors.o utilerrors.cpp
g++ -DHAVE_CONFIG_H -I. -I. -I../.. -I.. -O -pipe -Wall -Wno-non-virtual-dtor -c -o utilstrings.o utilstrings.cpp
rm -f libutil.a
ar cru libutil.a fileutil.o stdutil.o stringencoder.o util.o utilerrors.o utilstrings.o
ranlib libutil.a
ar ru ../../lib/libtripwire.a fileutil.o stdutil.o stringencoder.o util.o utilerrors.o utilstrings.o
ranlib ../../lib/libtripwire.a
make[3]: Leaving directory `/tmp/ats_security/tripwire-2.4.2.1/src/util'
Making all in twprint
make[3]: Entering directory `/tmp/ats_security/tripwire-2.4.2.1/src/twprint'
g++ -DHAVE_CONFIG_H -I. -I. -I../.. -I.. -O -pipe -Wall -Wno-non-virtual-dtor -c -o stdtwprint.o stdtwprint.cpp
g++ -DHAVE_CONFIG_H -I. -I. -I../.. -I.. -O -pipe -Wall -Wno-non-virtual-dtor -c -o twprint.o twprint.cpp
twprint.cpp: In member function `cTWPrint::cTWPrint()':
twprint.cpp:69: warning: unused variable `RegisterErrorstwprint registertwprint
'
g++ -DHAVE_CONFIG_H -I. -I. -I../.. -I.. -O -pipe -Wall -Wno-non-virtual-dtor -c -o twprintcmdline.o twprintcmdline.cpp
g++ -DHAVE_CONFIG_H -I. -I. -I../.. -I.. -O -pipe -Wall -Wno-non-virtual-dtor -c -o twprinterrors.o twprinterrors.cpp
g++ -DHAVE_CONFIG_H -I. -I. -I../.. -I.. -O -pipe -Wall -Wno-non-virtual-dtor -c -o twprintmain.o twprintmain.cpp
g++ -DHAVE_CONFIG_H -I. -I. -I../.. -I.. -O -pipe -Wall -Wno-non-virtual-dtor -c -o twprintstrings.o twprintstrings.cpp
g++ -O -pipe -Wall -Wno-non-virtual-dtor -L../../lib -o twprint stdtwprint.o twprint.o twprintcmdline.o twprinterrors.o twprintmain.o twprintstrings.o -ltripwire -lcryptlib -lcrypto
make[3]: Leaving directory `/tmp/ats_security/tripwire-2.4.2.1/src/twprint'
Making all in twadmin
make[3]: Entering directory `/tmp/ats_security/tripwire-2.4.2.1/src/twadmin'
g++ -DHAVE_CONFIG_H -I. -I. -I../.. -I.. -O -pipe -Wall -Wno-non-virtual-dtor -c -o keygeneration.o keygeneration.cpp
g++ -DHAVE_CONFIG_H -I. -I. -I../.. -I.. -O -pipe -Wall -Wno-non-virtual-dtor -c -o stdtwadmin.o stdtwadmin.cpp
g++ -DHAVE_CONFIG_H -I. -I. -I../.. -I.. -O -pipe -Wall -Wno-non-virtual-dtor -c -o twadmin.o twadmin.cpp
twadmin.cpp: In member function `cTWAdmin::cTWAdmin()':
twadmin.cpp:69: warning: unused variable `RegisterErrorstwadmin registertwadmin
'
g++ -DHAVE_CONFIG_H -I. -I. -I../.. -I.. -O -pipe -Wall -Wno-non-virtual-dtor -c -o twadmincl.o twadmincl.cpp
twadmincl.cpp: In function `bool ChangePassphrase(const char*, wc16_string,
wc16_string)':
twadmincl.cpp:1866: `swab' undeclared (first use this function)
twadmincl.cpp:1866: (Each undeclared identifier is reported only once for each
function it appears in.)
twadmincl.cpp: In function `bool NotifyEncryptionType(cFileHeader::Encoding,
iUserNotify::VerboseLevel)':
twadmincl.cpp:2673: warning: enumeration value `SYM_ENCRYPTION' not handled in
switch
twadmincl.cpp:2673: warning: enumeration value `LAST_ENCODING' not handled in
switch
make[3]: *** [twadmincl.o] Error 1
make[3]: Leaving directory `/tmp/ats_security/tripwire-2.4.2.1/src/twadmin'
make[2]: *** [all-recursive] Error 1
make[2]: Leaving directory `/tmp/ats_security/tripwire-2.4.2.1/src'
make[1]: *** [all-recursive] Error 1
make[1]: Leaving directory `/tmp/ats_security/tripwire-2.4.2.1'
make: *** [all] Error 2
Making install in man
make[1]: Entering directory `/tmp/ats_security/tripwire-2.4.2.1/man'
Making install in man4
make[2]: Entering directory `/tmp/ats_security/tripwire-2.4.2.1/man/man4'
make[3]: Entering directory `/tmp/ats_security/tripwire-2.4.2.1/man/man4'
make[3]: Nothing to be done for `install-exec-am'.
test -z "/usr/share/man/man4" || mkdir -p -- . "/usr/share/man/man4"
/usr/bin/install -c -m 644 './twconfig.4' '/usr/share/man/man4/twconfig.4'
/usr/bin/install -c -m 644 './twpolicy.4' '/usr/share/man/man4/twpolicy.4'
make[3]: Leaving directory `/tmp/ats_security/tripwire-2.4.2.1/man/man4'
make[2]: Leaving directory `/tmp/ats_security/tripwire-2.4.2.1/man/man4'
Making install in man5
make[2]: Entering directory `/tmp/ats_security/tripwire-2.4.2.1/man/man5'
make[3]: Entering directory `/tmp/ats_security/tripwire-2.4.2.1/man/man5'
make[3]: Nothing to be done for `install-exec-am'.
test -z "/usr/share/man/man5" || mkdir -p -- . "/usr/share/man/man5"
/usr/bin/install -c -m 644 './twfiles.5' '/usr/share/man/man5/twfiles.5'
make[3]: Leaving directory `/tmp/ats_security/tripwire-2.4.2.1/man/man5'
make[2]: Leaving directory `/tmp/ats_security/tripwire-2.4.2.1/man/man5'
Making install in man8
make[2]: Entering directory `/tmp/ats_security/tripwire-2.4.2.1/man/man8'
make[3]: Entering directory `/tmp/ats_security/tripwire-2.4.2.1/man/man8'
make[3]: Nothing to be done for `install-exec-am'.
test -z "/usr/share/man/man8" || mkdir -p -- . "/usr/share/man/man8"
/usr/bin/install -c -m 644 './siggen.8' '/usr/share/man/man8/siggen.8'
/usr/bin/install -c -m 644 './tripwire.8' '/usr/share/man/man8/tripwire.8'
/usr/bin/install -c -m 644 './twadmin.8' '/usr/share/man/man8/twadmin.8'
/usr/bin/install -c -m 644 './twintro.8' '/usr/share/man/man8/twintro.8'
/usr/bin/install -c -m 644 './twprint.8' '/usr/share/man/man8/twprint.8'
make[3]: Leaving directory `/tmp/ats_security/tripwire-2.4.2.1/man/man8'
make[2]: Leaving directory `/tmp/ats_security/tripwire-2.4.2.1/man/man8'
make[2]: Entering directory `/tmp/ats_security/tripwire-2.4.2.1/man'
make[3]: Entering directory `/tmp/ats_security/tripwire-2.4.2.1/man'
make[3]: Nothing to be done for `install-exec-am'.
make[3]: Nothing to be done for `install-data-am'.
make[3]: Leaving directory `/tmp/ats_security/tripwire-2.4.2.1/man'
make[2]: Leaving directory `/tmp/ats_security/tripwire-2.4.2.1/man'
make[1]: Leaving directory `/tmp/ats_security/tripwire-2.4.2.1/man'
Making install in src
make[1]: Entering directory `/tmp/ats_security/tripwire-2.4.2.1/src'
Making install in cryptlib
make[2]: Entering directory `/tmp/ats_security/tripwire-2.4.2.1/src/cryptlib'
make[3]: Entering directory `/tmp/ats_security/tripwire-2.4.2.1/src/cryptlib'
make[3]: Nothing to be done for `install-exec-am'.
make[3]: Nothing to be done for `install-data-am'.
make[3]: Leaving directory `/tmp/ats_security/tripwire-2.4.2.1/src/cryptlib'
make[2]: Leaving directory `/tmp/ats_security/tripwire-2.4.2.1/src/cryptlib'
Making install in core
make[2]: Entering directory `/tmp/ats_security/tripwire-2.4.2.1/src/core'
make[3]: Entering directory `/tmp/ats_security/tripwire-2.4.2.1/src/core'
make[3]: Nothing to be done for `install-exec-am'.
make[3]: Nothing to be done for `install-data-am'.
make[3]: Leaving directory `/tmp/ats_security/tripwire-2.4.2.1/src/core'
make[2]: Leaving directory `/tmp/ats_security/tripwire-2.4.2.1/src/core'
Making install in db
make[2]: Entering directory `/tmp/ats_security/tripwire-2.4.2.1/src/db'
make[3]: Entering directory `/tmp/ats_security/tripwire-2.4.2.1/src/db'
make[3]: Nothing to be done for `install-exec-am'.
make[3]: Nothing to be done for `install-data-am'.
make[3]: Leaving directory `/tmp/ats_security/tripwire-2.4.2.1/src/db'
make[2]: Leaving directory `/tmp/ats_security/tripwire-2.4.2.1/src/db'
Making install in fco
make[2]: Entering directory `/tmp/ats_security/tripwire-2.4.2.1/src/fco'
make[3]: Entering directory `/tmp/ats_security/tripwire-2.4.2.1/src/fco'
make[3]: Nothing to be done for `install-exec-am'.
make[3]: Nothing to be done for `install-data-am'.
make[3]: Leaving directory `/tmp/ats_security/tripwire-2.4.2.1/src/fco'
make[2]: Leaving directory `/tmp/ats_security/tripwire-2.4.2.1/src/fco'
Making install in fs
make[2]: Entering directory `/tmp/ats_security/tripwire-2.4.2.1/src/fs'
make[3]: Entering directory `/tmp/ats_security/tripwire-2.4.2.1/src/fs'
make[3]: Nothing to be done for `install-exec-am'.
make[3]: Nothing to be done for `install-data-am'.
make[3]: Leaving directory `/tmp/ats_security/tripwire-2.4.2.1/src/fs'
make[2]: Leaving directory `/tmp/ats_security/tripwire-2.4.2.1/src/fs'
Making install in tw
make[2]: Entering directory `/tmp/ats_security/tripwire-2.4.2.1/src/tw'
make[3]: Entering directory `/tmp/ats_security/tripwire-2.4.2.1/src/tw'
make[3]: Nothing to be done for `install-exec-am'.
make[3]: Nothing to be done for `install-data-am'.
make[3]: Leaving directory `/tmp/ats_security/tripwire-2.4.2.1/src/tw'
make[2]: Leaving directory `/tmp/ats_security/tripwire-2.4.2.1/src/tw'
Making install in twcrypto
make[2]: Entering directory `/tmp/ats_security/tripwire-2.4.2.1/src/twcrypto'
make[3]: Entering directory `/tmp/ats_security/tripwire-2.4.2.1/src/twcrypto'
make[3]: Nothing to be done for `install-exec-am'.
make[3]: Nothing to be done for `install-data-am'.
make[3]: Leaving directory `/tmp/ats_security/tripwire-2.4.2.1/src/twcrypto'
make[2]: Leaving directory `/tmp/ats_security/tripwire-2.4.2.1/src/twcrypto'
Making install in twparser
make[2]: Entering directory `/tmp/ats_security/tripwire-2.4.2.1/src/twparser'
make[3]: Entering directory `/tmp/ats_security/tripwire-2.4.2.1/src/twparser'
make[3]: Nothing to be done for `install-exec-am'.
make[3]: Nothing to be done for `install-data-am'.
make[3]: Leaving directory `/tmp/ats_security/tripwire-2.4.2.1/src/twparser'
make[2]: Leaving directory `/tmp/ats_security/tripwire-2.4.2.1/src/twparser'
Making install in util
make[2]: Entering directory `/tmp/ats_security/tripwire-2.4.2.1/src/util'
make[3]: Entering directory `/tmp/ats_security/tripwire-2.4.2.1/src/util'
make[3]: Nothing to be done for `install-exec-am'.
make[3]: Nothing to be done for `install-data-am'.
make[3]: Leaving directory `/tmp/ats_security/tripwire-2.4.2.1/src/util'
make[2]: Leaving directory `/tmp/ats_security/tripwire-2.4.2.1/src/util'
Making install in twprint
make[2]: Entering directory `/tmp/ats_security/tripwire-2.4.2.1/src/twprint'
make[3]: Entering directory `/tmp/ats_security/tripwire-2.4.2.1/src/twprint'
test -z "/usr/sbin" || mkdir -p -- . "/usr/sbin"
/usr/bin/install -c 'twprint' '/usr/sbin/twprint'
make[3]: Nothing to be done for `install-data-am'.
make[3]: Leaving directory `/tmp/ats_security/tripwire-2.4.2.1/src/twprint'
make[2]: Leaving directory `/tmp/ats_security/tripwire-2.4.2.1/src/twprint'
Making install in twadmin
make[2]: Entering directory `/tmp/ats_security/tripwire-2.4.2.1/src/twadmin'
g++ -DHAVE_CONFIG_H -I. -I. -I../.. -I.. -O -pipe -Wall -Wno-non-virtual-dtor -c -o twadmincl.o twadmincl.cpp
twadmincl.cpp: In function `bool ChangePassphrase(const char*, wc16_string,
wc16_string)':
twadmincl.cpp:1866: `swab' undeclared (first use this function)
twadmincl.cpp:1866: (Each undeclared identifier is reported only once for each
function it appears in.)
twadmincl.cpp: In function `bool NotifyEncryptionType(cFileHeader::Encoding,
iUserNotify::VerboseLevel)':
twadmincl.cpp:2673: warning: enumeration value `SYM_ENCRYPTION' not handled in
switch
twadmincl.cpp:2673: warning: enumeration value `LAST_ENCODING' not handled in
switch
make[2]: *** [twadmincl.o] Error 1
make[2]: Leaving directory `/tmp/ats_security/tripwire-2.4.2.1/src/twadmin'
make[1]: *** [install-recursive] Error 1
make[1]: Leaving directory `/tmp/ats_security/tripwire-2.4.2.1/src'
make: *** [install-recursive] Error 1

I was able to compile on RedHat 5.6 and CentOS 4.8, though.

Discussion