SysTools for Delphi2007?

Help
Mike Dunn
2008-07-07
2013-01-15
  • Mike Dunn
    Mike Dunn
    2008-07-07

    I have a celab install of Delphi 2007 Win32.  Downloaded the latest version 4.04 of SysTools which contained all the packages for Delphi 2005 and 2006.  I tried to compile it in Delphi 2007 and got the following error.

    [DCC Error]  S404_r100.dpk(142):F1026 File not found: 'StAstro.dcu'

    I have the S404_r.bpl included in my library path.

    QUESTION:
    1.  Should I be able to compile the Delphi 2006 package in Delphi 2007 or do I need to wait for someone to create a newer version?
    2.  If I should be able to compile the Delphi 2006 packages, what am I doing wrong?
    3.  Does anyone out there have a Delphi 2007 package?

    Thanks,

    Mike

    Below is the complete output message from the compile:
    Build
      [DCC Error] S404_r100.dpk(142): F1026 File not found: 'StAstro.dcu'
    Output
      Build started 7/7/2008 11:19:36 AM.
      __________________________________________________
      Project "C:\Program Files\CodeGear\RAD Studio\5.0\lib\packages\S404_r100.dproj" (Make target(s)):
      Target CoreCompile:
          c:\program files\codegear\rad studio\5.0\bin\dcc32.exe -I"C:\Program Files\Toolkits\EXTRA\LIB";"C:\Program Files\CodeGear\RAD Studio\5.0\lib";"C:\Program Files\CodeGear\RAD Studio\5.0\RaveReports\Lib";"c:\program files\developer express.vcl\library\delphi11";"c:\documents and settings\all users\documents\rad studio\5.0\bpl";"C:\Program Files\Toolkits\Orpheus\source";"C:\Program Files\Toolkits\RBuilder 10\Lib";"c:\program files\toolkits\abbrevia\source";"c:\ai 2008 suite\ai lablinx 2.2";"C:\Program Files\Toolkits\Addict3\Source\d105";"C:\Program Files\Toolkits\TRichView";"C:\Program Files\Toolkits\Turbopower\TurboPower SysTools\packages";"C:\Program Files\CodeGear\RAD Studio\5.0\lib\packages" -LE"C:\Program Files\CodeGear\RAD Studio\5.0\bpl" -LN"C:\Program Files\CodeGear\RAD Studio\5.0\dcp" -M -O"C:\Program Files\Toolkits\EXTRA\LIB";"C:\Program Files\CodeGear\RAD Studio\5.0\lib";"C:\Program Files\CodeGear\RAD Studio\5.0\RaveReports\Lib";"c:\program files\developer express.vcl\library\delphi11";"c:\documents and settings\all users\documents\rad studio\5.0\bpl";"C:\Program Files\Toolkits\Orpheus\source";"C:\Program Files\Toolkits\RBuilder 10\Lib";"c:\program files\toolkits\abbrevia\source";"c:\ai 2008 suite\ai lablinx 2.2";"C:\Program Files\Toolkits\Addict3\Source\d105";"C:\Program Files\Toolkits\TRichView";"C:\Program Files\Toolkits\Turbopower\TurboPower SysTools\packages";"C:\Program Files\CodeGear\RAD Studio\5.0\lib\packages" -R"C:\Program Files\Toolkits\EXTRA\LIB";"C:\Program Files\CodeGear\RAD Studio\5.0\lib";"C:\Program Files\CodeGear\RAD Studio\5.0\RaveReports\Lib";"c:\program files\developer express.vcl\library\delphi11";"c:\documents and settings\all users\documents\rad studio\5.0\bpl";"C:\Program Files\Toolkits\Orpheus\source";"C:\Program Files\Toolkits\RBuilder 10\Lib";"c:\program files\toolkits\abbrevia\source";"c:\ai 2008 suite\ai lablinx 2.2";"C:\Program Files\Toolkits\Addict3\Source\d105";"C:\Program Files\Toolkits\TRichView";"C:\Program Files\Toolkits\Turbopower\TurboPower SysTools\packages";"C:\Program Files\CodeGear\RAD Studio\5.0\lib\packages" -U"C:\Program Files\Toolkits\EXTRA\LIB";"C:\Program Files\CodeGear\RAD Studio\5.0\lib";"C:\Program Files\CodeGear\RAD Studio\5.0\RaveReports\Lib";"c:\program files\developer express.vcl\library\delphi11";"c:\documents and settings\all users\documents\rad studio\5.0\bpl";"C:\Program Files\Toolkits\Orpheus\source";"C:\Program Files\Toolkits\RBuilder 10\Lib";"c:\program files\toolkits\abbrevia\source";"c:\ai 2008 suite\ai lablinx 2.2";"C:\Program Files\Toolkits\Addict3\Source\d105";"C:\Program Files\Toolkits\TRichView";"C:\Program Files\Toolkits\Turbopower\TurboPower SysTools\packages";"C:\Program Files\CodeGear\RAD Studio\5.0\lib\packages" --no-config -$J+ -$O- -$Y-   S404_r100.dpk  
          C:\Program Files\CodeGear\RAD Studio\5.0\lib\packages\S404_r100.dpk(142,38): Fatal Error error 1026: F1026 File not found: 'StAstro.dcu'
      Done building target "CoreCompile" in project "S404_r100.dproj" -- FAILED.
      Done building project "S404_r100.dproj" -- FAILED.
      Build FAILED.
      C:\Program Files\CodeGear\RAD Studio\5.0\lib\packages\S404_r100.dpk(142,38): Fatal Error error 1026: F1026 File not found: 'StAstro.dcu'
          0 Warning(s)
          1 Error(s)
      Time Elapsed 00:00:00.29