Work at SourceForge, help us to make it a better place! We have an immediate need for a Support Technician in our San Francisco or Denver office.

Close

#1298 test suite failures on Digital Unix Tru64

obsolete: 8.2.1
closed-duplicate
Don Porter
69. Other (102)
5
2002-03-24
2000-10-26
Anonymous
No

OriginalBugID: 3351 Bug
Version: 8.2.1
SubmitDate: '1999-11-05'
LastModified: '1999-11-23'
Severity: MED
Status: UnAssn
Submitter: techsupp
ChangedBy: jenn
OS: Digital Unix
OSVersion: Tru64 Unix 5.0
FixedDate: '2000-10-25'
ClosedDate: '2000-10-25'

Name:
Don Porter

Comments:
Testing done on Compaq's Test Drive system

http://www.testdrive.compaq.com/

ObservedBehavior:
$ cd tcl8.2.1/unix
$ configure
$ make test
...
==== clock-3.2 clock format tests FAILED
---- Result was:
ESTPST
---- Result should have been:
GMTPST
==== clock-3.2 FAILED

==== clock-3.4 clock format tests FAILED
---- Result was:
ESTEST
---- Result should have been:
GMTGMT
==== clock-3.4 FAILED

==== fCmd-6.14 CopyRenameOneFile: source is file, target is dir FAILED
==== Test generated error:
can't create directory "td1/tf1": permission denied
---- Result should have been:
1 {can't overwrite directory "td1/tf1" with file "tf1"}
==== fCmd-6.14 FAILED

==== fCmd-9.8 file rename: comprehensive: dir to empty dir FAILED
==== Test generated error:
can't create directory "td2/td1": permission denied
---- Result should have been:
{td1 td2 tdd1 tdd2 tdd3 tdd4} {1 {error renaming "td1" to "td2/td1":
file already exists}} 1 1 0 0
==== fCmd-9.8 FAILED

==== format-6.3 floating-point zeroes FAILED
---- Result was:
0.0000e+00 0.0000 0.0000
---- Result should have been:
0.0000e+00 0.0000 0.000
==== format-6.3 FAILED

==== format-6.5 floating-point zeroes FAILED
---- Result was:
0.e+00 0. 0.0
---- Result should have been:
0.e+00 0. 0.
==== format-6.5 FAILED

==== io-44.5 FileEventProc procedure: end of file FAILED
==== Test generated error:
can't wait for variable "x": would wait forever
---- Result should have been:
initial foo eof
==== io-44.5 FAILED

==== string-6.36 string is double, false FAILED
==== Contents of test case:
---- Result was:
1 8
---- Result should have been:
0 0
==== string-6.36 FAILED

Discussion

  • Don Porter
    Don Porter
    2001-04-05

    • labels: 104252 --> 69. Other
     
  • Logged In: YES
    user_id=79902

    Some of these look like wierd permissions problems...

     
  • Jeffrey Hobbs
    Jeffrey Hobbs
    2002-03-22

    • assigned_to: nobody --> dgp
     
  • Don Porter
    Don Porter
    2002-03-24

    Logged In: YES
    user_id=80530

    I believe these are all duplicates now.

     
  • Don Porter
    Don Porter
    2002-03-24

    • status: open --> closed-duplicate