Work at SourceForge, help us to make it a better place! We have an immediate need for a Support Technician in our San Francisco or Denver office.

Close

Needed! A Driver Compatible with Linux 3.2.0-

Help
Anonymous
2012-04-28
2013-05-28

  • Anonymous
    2012-04-28

    Needed! A Driver Compatible with Linux 3.2.0-0.bpo.1-amd64. the driver does not compile there. I use Debian squeeze with backports.
    This is what I get:

     

  • Anonymous
    2012-04-28

    sorry I pressed add topic by mistake.
    So this is what i get in building the driver of smartcam:
    root@debian-hp:/home/oracle/Downloads/smartcam/smartcam-1.4.0/driver_src# make -C /lib/modules/`uname -r`/build M=`pwd`
    make: Entering directory `/usr/src/linux-headers-3.2.0-0.bpo.1-amd64'
      CC   /home/oracle/Downloads/smartcam/smartcam-1.4.0/driver_src/smartcam.o
    /home/oracle/Downloads/smartcam/smartcam-1.4.0/driver_src/smartcam.c: In function ‘vidioc_s_fmt_cap’:
    /home/oracle/Downloads/smartcam/smartcam-1.4.0/driver_src/smartcam.c:174: error: dereferencing pointer to incomplete type
    /home/oracle/Downloads/smartcam/smartcam-1.4.0/driver_src/smartcam.c: In function ‘smartcam_write’:
    /home/oracle/Downloads/smartcam/smartcam-1.4.0/driver_src/smartcam.c:533: error: ‘TASK_INTERRUPTIBLE’ undeclared (first use in this function)
    /home/oracle/Downloads/smartcam/smartcam-1.4.0/driver_src/smartcam.c:533: error: (Each undeclared identifier is reported only once
    /home/oracle/Downloads/smartcam/smartcam-1.4.0/driver_src/smartcam.c:533: error: for each function it appears in.)
    /home/oracle/Downloads/smartcam/smartcam-1.4.0/driver_src/smartcam.c: At top level:
    /home/oracle/Downloads/smartcam/smartcam-1.4.0/driver_src/smartcam.c:563: error: unknown field ‘ioctl’ specified in initializer
    /home/oracle/Downloads/smartcam/smartcam-1.4.0/driver_src/smartcam.c:599: error: ‘VID_TYPE_CAPTURE’ undeclared here (not in a function)
    /home/oracle/Downloads/smartcam/smartcam-1.4.0/driver_src/smartcam.c:601: warning: initialization from incompatible pointer type
    make: ***  Error 1
    make: ***  Error 2
    make: ***  Error 2
    make: ***  Error 2
    make: Leaving directory `/usr/src/linux-headers-3.2.0-0.bpo.1-amd64'
    root@debian-hp:/home/oracle/Downloads/