Work at SourceForge, help us to make it a better place! We have an immediate need for a Support Technician in our San Francisco or Denver office.

Close

#89 Error when compiling SKT 3.2.2

open
nobody
Other (2)
5
2012-08-02
2012-08-02
Jonathan
No

I encountered the following error messages while attempting to compile 3.2.2 on Windows 7 using Visual Studio 2010. Any help would be appreciated.
auto.cpp
walk_cpp.cpp
Generating Code...
Lib:
libtsk.vcxproj -> C:\Digital_Forensics\Project\sleuthkit-sleuthkit-
9b83edc\win32\Debug\libtsk.lib
PostBuildEvent:
The system cannot find the path specified.
File not found - zlib1.dll
0 File(s) copied
C:\Program Files\MSBuild\Microsoft.Cpp\v4.0\Microsoft.CppCommon.targets(113,5): error MSB3073:
The command "copy "c:\Digital_Forensics\Project\libewf-20120603msvscpp\release\libewf.dll"
"C:\Digital_Forensics\Project\sleuthkit-sleuthkit-9b83edc\win32\Debug\"
C:\Program Files\MSBuild\Microsoft.Cpp\v4.0\Microsoft.CppCommon.targets(113,5): error MSB3073:
IF EXIST "c:\Digital_Forensics\Project\libewf-20120603\msvscpp\zlib-1.2.6" (
C:\Program Files\MSBuild\Microsoft.Cpp\v4.0\Microsoft.CppCommon.targets(113,5): error MSB3073:
xcopy "c:\Digital_Forensics\Project\libewf-20120603\msvscpp\Release\zlib.dll"
"C:\Digital_Forensics\Project\sleuthkit-sleuthkit-9b83edc\win32\Debug\" /R /Y
C:\Program Files\MSBuild\Microsoft.Cpp\v4.0\Microsoft.CppCommon.targets(113,5): error MSB3073:
) ELSE (
C:\Program Files\MSBuild\Microsoft.Cpp\v4.0\Microsoft.CppCommon.targets(113,5): error MSB3073:
xcopy "c:\Digital_Forensics\Project\libewf-20120603\msvscpp\zlib\zlib1.dll"
"C:\Digital_Forensics\Project\sleuthkit-sleuthkit-9b83edc\win32\Debug\" /R /Y
C:\Program Files\MSBuild\Microsoft.Cpp\v4.0\Microsoft.CppCommon.targets(113,5): error MSB3073:
)
C:\Program Files\MSBuild\Microsoft.Cpp\v4.0\Microsoft.CppCommon.targets(113,5): error MSB3073:
C:\Program Files\MSBuild\Microsoft.Cpp\v4.0\Microsoft.CppCommon.targets(113,5): error MSB3073:
:VCEnd" exited with code 4.
Build FAILED.
Time Elapsed 00:00:29.59

Discussion

  • Jonathan
    Jonathan
    2012-08-02

    Error messages

     
    Attachments