0.16.1 compilation failure in libegg subdir

Help
SC-CSU
2009-07-16
2013-04-11
  • SC-CSU
    SC-CSU
    2009-07-16

    Compilation fails on FC11 x86-64 in the libegg portion of the code:

    In file included from egg-recent-view.c:29:
    egg-recent-view.h:33: error: expected '=', ',', ';', 'asm' or '__attribute__' before 'egg_recent_view_get_type'
    egg-recent-view.c:32: error: expected '=', ',', ';', 'asm' or '__attribute__' before 'egg_recent_view_get_type'
    egg-recent-view.c: In function 'egg_recent_view_get_model':
    egg-recent-view.c:58: warning: implicit declaration of function 'egg_recent_view_get_type'
    make[3]: *** [egg-recent-view.lo] Error 1

    any thoughts???

    thanks!

     
    • Bill Hammond
      Bill Hammond
      2009-08-06

      I'm getting the same error message while compiling 0.17.1.  I'd be interested in learning about the fix for this.

      Bill

       
  • Jim Hayward
    Jim Hayward
    2009-11-07

    This should be fixed now in current CVS.