#70 Problem compiling rxvt-2.7.10

open
Oezguer Kesim
None
5
2014-09-11
2006-10-21
Pierre
No

# make
make[1]: Entering directory `/tmp/rxvt-2.7.10/src'
/bin/sh ../libtool --mode=compile gcc -DHAVE_CONFIG_H
-I/usr/local/include -s -O3 -march=i686
-DDEBUG_STRICT -I/usr/local/include -I.. -I. -I. -c
strings.c
rm -f .libs/strings.lo
gcc -DHAVE_CONFIG_H -I/usr/local/include -s -O3
-march=i686 -DDEBUG_STRICT -I/usr/local/include -I..
-I. -I. -c strings.c -fPIC -DPIC -o strings.o
strings.c:58: error: parse error before "__extension__"
strings.c:62: error: parse error before '++' token
strings.c:68: error: parse error before "__extension__"
strings.c:73: warning: data definition has no type or
storage class
strings.c:73: error: parse error before '--' token
strings.c:84: error: parse error before '&&' token
strings.c:84: warning: data definition has no type or
storage class
strings.c:84: error: parse error before '}' token
strings.c:84: error: static declaration of '__result'
follows non-static declaration
strings.c:84: error: previous declaration of '__result'
was here
strings.c:84: error: parse error before "s1"
strings.c:84: error: `__s2' undeclared here (not in a
function)
strings.c:84: error: parse error before "if"
strings.c:84: error: non-static declaration of
'__result' follows static declaration
strings.c:84: error: previous definition of '__result'
was here
strings.c:84: error: non-static declaration of
'__result' follows static declaration
strings.c:84: error: previous definition of '__result'
was here
strings.c:84: warning: data definition has no type or
storage class
strings.c:84: error: parse error before '}' token
strings.c:84: warning: data definition has no type or
storage class
strings.c:84: error: parse error before '}' token
strings.c:84: error: static declaration of '__result'
follows non-static declaration
strings.c:84: error: previous declaration of '__result'
was here
strings.c:84: error: redefinition of '__result'
strings.c:84: error: previous definition of '__result'
was here
strings.c:84: error: `__s1' undeclared here (not in a
function)
strings.c:84: error: parse error before "s2"
strings.c:84: error: parse error before "if"
strings.c:84: error: non-static declaration of
'__result' follows static declaration
strings.c:84: error: previous definition of '__result'
was here
strings.c:84: error: non-static declaration of
'__result' follows static declaration
strings.c:84: error: previous definition of '__result'
was here
strings.c:84: warning: data definition has no type or
storage class
strings.c:84: error: parse error before '}' token
strings.c:86: error: parse error before '==' token
strings.c:94: error: parse error before "__extension__"
strings.c:94: error: parse error before '&&' token
strings.c:94: warning: data definition has no type or
storage class
strings.c:94: error: parse error before '}' token
strings.c:94: error: static declaration of '__result'
follows non-static declaration
strings.c:94: error: previous declaration of '__result'
was here
strings.c:94: error: redefinition of '__result'
strings.c:84: error: previous definition of '__result'
was here
strings.c:94: error: parse error before "s1"
strings.c:94: error: parse error before "if"
strings.c:94: error: non-static declaration of
'__result' follows static declaration
strings.c:94: error: previous definition of '__result'
was here
strings.c:94: error: non-static declaration of
'__result' follows static declaration
strings.c:84: error: previous definition of '__result'
was here
strings.c:94: warning: data definition has no type or
storage class
strings.c:94: error: parse error before '}' token
strings.c:94: warning: data definition has no type or
storage class
strings.c:94: error: parse error before '}' token
strings.c:94: error: static declaration of '__result'
follows non-static declaration
strings.c:94: error: previous declaration of '__result'
was here
strings.c:94: error: redefinition of '__result'
strings.c:84: error: previous definition of '__result'
was here
strings.c:94: error: parse error before "s2"
strings.c:94: error: parse error before "if"
strings.c:94: error: non-static declaration of
'__result' follows static declaration
strings.c:94: error: previous definition of '__result'
was here
strings.c:94: error: non-static declaration of
'__result' follows static declaration
strings.c:84: error: previous definition of '__result'
was here
strings.c:94: warning: data definition has no type or
storage class
strings.c:94: error: parse error before '}' token
strings.c:119: error: parse error before "__extension__"
strings.c:126: warning: data definition has no type or
storage class
strings.c:128: error: parse error before "return"
strings.c:143: error: parse error before "__extension__"
strings.c:143: error: `__len' undeclared here (not in a
function)
strings.c:143: error: initializer element is not constant
strings.c:143: error: parse error before "if"
strings.c:143: error: conflicting types for '__retval'
strings.c:143: error: previous definition of '__retval'
was here
strings.c:143: warning: data definition has no type or
storage class
strings.c:143: error: parse error before '}' token
strings.c:148: error: parse error before "if"
strings.c:162: error: parse error before "__extension__"
strings.c: In function `memmove':
strings.c:229: warning: use of cast expressions as
lvalues is deprecated
strings.c:229: warning: use of cast expressions as
lvalues is deprecated
strings.c:245: warning: use of cast expressions as
lvalues is deprecated
strings.c:245: warning: use of cast expressions as
lvalues is deprecated
strings.c: At top level:
strings.c:271: error: parse error before "__extension__"
strings.c:271: error: parse error before "__uint8_t"
strings.c:271: warning: data definition has no type or
storage class
strings.c:271: error: parse error before '}' token
strings.c:271: warning: initialization makes pointer
from integer without a cast
strings.c:271: error: initializer element is not constant
strings.c:271: error: parse error before "c1"
strings.c:271: error: conflicting types for '__u'
strings.c:271: error: previous definition of '__u' was here
strings.c:271: warning: initialization makes integer
from pointer without a cast
strings.c:271: error: initializer element is not constant
strings.c:271: warning: data definition has no type or
storage class
strings.c:271: error: parse error before "case"
strings.c:271: error: redefinition of '__u'
strings.c:271: error: previous definition of '__u' was here
strings.c:271: error: redefinition of '__u'
strings.c:271: error: previous definition of '__u' was here
strings.c:271: warning: initialization makes integer
from pointer without a cast
strings.c:271: error: initializer element is not constant
strings.c:271: warning: data definition has no type or
storage class
strings.c:271: error: parse error before "case"
strings.c:271: error: redefinition of '__u'
strings.c:271: error: previous definition of '__u' was here
strings.c:271: error: redefinition of '__u'
strings.c:271: error: previous definition of '__u' was here
strings.c:271: warning: initialization makes integer
from pointer without a cast
strings.c:271: error: initializer element is not constant
strings.c:271: warning: data definition has no type or
storage class
strings.c:271: error: parse error before "case"
strings.c:271: error: redefinition of '__u'
strings.c:271: error: previous definition of '__u' was here
strings.c:271: error: redefinition of '__u'
strings.c:271: error: previous definition of '__u' was here
strings.c:271: warning: initialization makes integer
from pointer without a cast
strings.c:271: error: initializer element is not constant
strings.c:271: warning: data definition has no type or
storage class
strings.c:271: error: parse error before '->' token
strings.c:271: error: redefinition of '__u'
strings.c:271: error: previous definition of '__u' was here
strings.c:271: error: redefinition of '__u'
strings.c:271: error: previous definition of '__u' was here
strings.c:271: warning: initialization makes integer
from pointer without a cast
strings.c:271: error: initializer element is not constant
strings.c:271: warning: data definition has no type or
storage class
strings.c:271: error: parse error before "case"
strings.c:271: error: redefinition of '__u'
strings.c:271: error: previous definition of '__u' was here
strings.c:271: error: redefinition of '__u'
strings.c:271: error: previous definition of '__u' was here
strings.c:271: warning: initialization makes integer
from pointer without a cast
strings.c:271: error: initializer element is not constant
strings.c:271: warning: data definition has no type or
storage class
strings.c:271: error: parse error before "case"
strings.c:271: error: redefinition of '__u'
strings.c:271: error: previous definition of '__u' was here
strings.c:271: error: redefinition of '__u'
strings.c:271: error: previous definition of '__u' was here
strings.c:271: warning: initialization makes integer
from pointer without a cast
strings.c:271: error: initializer element is not constant
strings.c:271: warning: data definition has no type or
storage class
strings.c:271: error: parse error before "case"
strings.c:271: error: redefinition of '__u'
strings.c:271: error: previous definition of '__u' was here
strings.c:271: error: redefinition of '__u'
strings.c:271: error: previous definition of '__u' was here
strings.c:271: warning: initialization makes integer
from pointer without a cast
strings.c:271: error: initializer element is not constant
strings.c:271: warning: data definition has no type or
storage class
strings.c:271: error: parse error before "case"
strings.c:271: error: redefinition of '__u'
strings.c:271: error: previous definition of '__u' was here
strings.c:271: error: redefinition of '__u'
strings.c:271: error: previous definition of '__u' was here
strings.c:271: warning: initialization makes integer
from pointer without a cast
strings.c:271: error: initializer element is not constant
strings.c:271: warning: data definition has no type or
storage class
strings.c:271: error: parse error before "case"
strings.c:271: error: redefinition of '__u'
strings.c:271: error: previous definition of '__u' was here
strings.c:271: error: redefinition of '__u'
strings.c:271: error: previous definition of '__u' was here
strings.c:271: warning: initialization makes integer
from pointer without a cast
strings.c:271: error: initializer element is not constant
strings.c:271: warning: data definition has no type or
storage class
strings.c:271: error: parse error before "case"
strings.c:271: error: redefinition of '__u'
strings.c:271: error: previous definition of '__u' was here
strings.c:271: error: redefinition of '__u'
strings.c:271: error: previous definition of '__u' was here
strings.c:271: warning: initialization makes integer
from pointer without a cast
strings.c:271: error: initializer element is not constant
strings.c:271: warning: data definition has no type or
storage class
strings.c:271: error: parse error before "case"
strings.c:271: error: redefinition of '__u'
strings.c:271: error: previous definition of '__u' was here
strings.c:271: error: redefinition of '__u'
strings.c:271: error: previous definition of '__u' was here
strings.c:271: warning: initialization makes integer
from pointer without a cast
strings.c:271: error: initializer element is not constant
strings.c:271: warning: data definition has no type or
storage class
strings.c:271: error: parse error before "case"
strings.c:271: error: redefinition of '__u'
strings.c:271: error: previous definition of '__u' was here
strings.c:271: error: redefinition of '__u'
strings.c:271: error: previous definition of '__u' was here
strings.c:271: warning: initialization makes integer
from pointer without a cast
strings.c:271: error: initializer element is not constant
strings.c:271: warning: data definition has no type or
storage class
strings.c:271: error: parse error before "case"
strings.c:271: warning: data definition has no type or
storage class
strings.c:271: error: parse error before '}' token
strings.c:271: error: parse error before '\x0'
strings.c:271: warning: data definition has no type or
storage class
strings.c:271: warning: data definition has no type or
storage class
strings.c:271: error: parse error before '}' token
strings.c:274: error: conflicting types for 'c'
strings.c:146: error: previous declaration of 'c' was here
strings.c:274: error: `c1' undeclared here (not in a
function)
strings.c:275: error: `p' undeclared here (not in a
function)
strings.c:277: error: parse error before "if"
strings.c:287: error: initializer element is not constant
strings.c:287: warning: data definition has no type or
storage class
strings.c:289: error: parse error before '|=' token
make[1]: *** [strings.lo] Error 1
make[1]: Leaving directory `/tmp/rxvt-2.7.10/src'
make[1]: Entering directory `/tmp/rxvt-2.7.10/doc'
make[1]: Nothing to be done for `all'.
make[1]: Leaving directory `/tmp/rxvt-2.7.10/doc'
make[1]: Entering directory `/tmp/rxvt-2.7.10/rclock'
make[1]: Nothing to be done for `all'.
make[1]: Leaving directory `/tmp/rxvt-2.7.10/rclock'
make[1]: Entering directory `/tmp/rxvt-2.7.10/src/graphics'
make[1]: Nothing to be done for `all'.
make[1]: Leaving directory `/tmp/rxvt-2.7.10/src/graphics'
make[1]: Entering directory `/tmp/rxvt-2.7.10/src/test'
make[1]: Nothing to be done for `all'.
make[1]: Leaving directory `/tmp/rxvt-2.7.10/src/test'

Discussion

  • Oezguer Kesim
    Oezguer Kesim
    2008-05-10

    • assigned_to: nobody --> oec